program: Gaussian 09
title: 000063042
version: EM64L-G09RevD.01
frameworkgroup: C1[X(C22H27FO4)]
method: RPBEPBE
basis: SDD
operation: Freq
keyword: #p
keyword: freq=noraman
keyword: PBEPBE/SDD
title: #p freq=noraman PBEPBE/SDD
converged: NO YES NO NO
title: Mulliken charges:
elementType: F O O O O C C C C C C C C C C C C C C C C C C C C C C H H H H H H H H H H H H H H H H H H H H H H H H H H H
charge: -0.216848 -0.301401 -0.467159 -0.160203 -0.252568 0.353719 -0.117047 0.178152 -0.263998 0.307456 -0.111872 -0.593455 -0.614840 -0.246010 0.029726 -0.441342 -0.838381 -0.007305 -0.664499 -0.373359 0.634896 -0.749820 -0.769684 -0.178089 -0.652624 -0.400049 0.190716 0.299628 0.258225 0.260148 0.237718 0.227048 0.282215 0.212223 0.252955 0.224273 0.241278 0.243094 0.232478 0.262686 0.219797 0.243330 0.237924 0.243955 0.219594 0.247221 0.210429 0.218224 0.238914 0.283624 0.262912 0.353536 0.261011 0.251450
chargesum: 0.00000
title: Mulliken charges with hydrogens summed into heavy atoms:
elementType: F O O O O C C C C C C C C C C C C C C C C C C C C C C
charge: -0.216848 -0.301401 -0.113623 -0.160203 -0.252568 0.353719 0.182581 0.178152 -0.005772 0.307456 0.148276 -0.128689 -0.120403 0.006945 0.029726 0.024209 -0.100124 -0.007305 -0.201373 0.108520 0.634896 -0.072576 -0.028922 0.084823 -0.391613 -0.148599 0.190716
polarizability: 3.02984467e+02 6.03168687e+00 2.17042202e+02 -2.46833126e+01 3.18961300e+00 2.00805971e+02
1716.lowfreq: -16.3803 -4.5663 -0.0003 0.0004 0.0006 7.2815 27.5986 43.0249 56.4033
frequency: 27.2719 42.9200 56.3296 70.7852 78.3037 80.4242 118.7643 129.5285 148.9095 178.2691 182.9556 191.4659 203.9946 210.3669 221.1661 226.0425 237.8983 242.7129 248.1193 257.7266 263.6891 284.1740 294.8203 312.5040 321.3532 332.5809 356.7820 371.0736 381.7936 386.9110 417.8982 427.8768 438.8820 460.5365 471.7395 482.2215 500.8389 509.2041 517.9852 555.3555 563.4467 569.7637 589.8172 629.0130 653.7031 666.3165 686.5244 698.3641 712.0207 753.5077 768.9781 813.4559 830.8391 841.8056 851.5476 858.5083 867.6668 870.8696 895.3163 897.8826 902.3499 916.4509 919.1806 930.2900 945.6095 955.8979 959.1540 989.7584 994.1583 1005.7751 1013.5833 1026.5178 1027.9127 1040.2176 1051.1298 1063.2740 1064.9374 1082.2060 1092.5243 1098.5946 1102.4377 1110.2455 1121.2493 1135.5405 1137.1613 1155.7971 1162.3975 1167.8848 1184.2660 1196.2410 1205.4582 1219.6147 1226.9527 1238.4425 1246.0503 1257.4244 1264.8192 1276.6104 1290.0505 1291.3801 1298.7843 1306.2519 1310.5612 1324.6915 1339.4550 1346.8843 1348.9638 1351.8229 1366.2357 1375.4187 1384.2784 1388.3702 1393.3795 1398.3524 1433.5303 1457.7392 1462.5413 1466.5558 1467.7931 1468.4922 1472.4202 1478.1744 1485.9495 1491.2063 1498.4200 1557.9083 1619.9675 1668.0305 1720.8509 2951.8797 2968.5805 2969.7554 2977.1137 2981.1490 2984.4758 2987.9940 2991.1524 2993.5796 2996.8958 2997.8962 3002.8029 3045.6438 3050.1329 3056.5489 3057.9012 3059.8279 3071.0725 3079.4269 3093.4942 3098.6246 3099.3324 3110.5815 3129.3876 3131.3787 3149.8990 3564.1035
redmass: 6.3982 4.8083 6.5207 3.0288 2.8246 7.5806 3.5377 3.3172 3.0478 4.1887 2.4917 2.7605 4.2728 1.8280 2.3337 3.8416 1.5491 2.4136 2.6202 2.4033 1.9878 4.0306 1.4920 2.9550 2.3516 3.6083 3.2686 3.4861 4.1617 2.9714 4.0939 3.6432 2.8356 3.3690 3.7029 3.3579 2.7825 3.8401 3.8415 3.0788 3.2511 3.7318 4.7883 4.4645 3.0879 4.3388 3.3436 4.3247 5.7767 4.0529 3.3158 2.0674 1.6651 2.6302 2.9702 2.8244 2.9634 3.0051 2.9936 5.2910 1.7394 1.9168 1.6142 2.0783 2.3742 1.7262 2.5931 2.2761 2.1083 1.3098 2.5541 2.1674 2.4966 2.0655 3.1784 1.6514 1.5693 2.0108 3.2004 2.7503 1.9465 1.8032 2.2865 2.0467 2.0896 2.4192 1.8850 2.2967 1.9956 1.9333 1.3827 1.7510 1.5050 1.4519 1.5498 1.5429 1.3557 1.5517 1.5394 1.9227 1.4686 1.4342 1.7216 1.3251 1.3556 1.7949 1.3841 1.3926 1.4432 2.2540 1.4906 1.2072 1.3035 1.1921 1.0881 1.0853 1.0806 1.0865 1.0549 1.0644 1.0653 1.0480 1.0675 1.0546 1.0572 8.6656 8.5451 7.4285 12.5937 1.0678 1.0809 1.0648 1.0848 1.0526 1.0606 1.0560 1.0403 1.0736 1.0646 1.0672 1.0395 1.0951 1.0924 1.1067 1.1018 1.1033 1.0986 1.0975 1.0993 1.0998 1.0996 1.0866 1.0921 1.0991 1.0981 1.0659
irintensity: 2.7136 1.0936 0.2547 0.1541 4.0436 4.3019 0.7905 0.2747 3.8179 6.2821 5.4679 2.1126 3.6238 3.5898 1.8324 2.9975 7.6236 1.0519 17.2887 0.5314 31.4911 7.0252 76.5646 3.6784 32.4060 4.5309 0.7172 2.1828 2.7454 3.5574 9.1597 3.6483 1.3712 2.8311 4.8744 0.9674 12.1481 1.4243 4.6589 3.8161 2.4120 3.0219 10.2652 2.9641 0.4256 2.7223 16.1324 2.4672 9.9485 2.3943 0.4554 1.5147 12.7980 19.8579 9.7817 18.1251 17.2807 16.0815 7.9796 85.8107 29.2333 2.4912 3.3641 2.8681 21.9810 10.6638 23.2880 13.9829 13.2078 0.0559 54.4375 9.3835 1.6258 13.2998 27.9392 8.5449 4.8153 6.8346 3.2322 13.4135 21.8015 12.4528 3.5841 9.5230 7.4689 0.6158 6.0239 7.1045 30.0432 6.2032 5.0976 5.4838 7.4697 23.8473 13.8809 12.2836 3.4778 10.0039 43.8654 11.0058 5.9067 0.5602 0.0435 1.7707 1.0720 1.7623 9.3678 2.5964 4.5368 19.1632 3.0493 12.1274 20.8097 37.9795 16.4141 5.0461 10.2983 11.4332 19.5593 11.0608 9.2557 6.1942 1.2228 5.8571 7.8021 194.7075 14.9152 139.6657 214.2459 33.6040 0.3852 21.5030 40.9669 20.3880 19.6937 40.0935 10.5175 1.3897 38.6677 23.5018 33.0071 27.1510 5.0008 10.0717 26.8933 26.1035 36.7043 17.8053 32.6355 3.4993 25.7125 5.1833 9.3640 3.6878 13.7015 7.4693
temp: 298.150 k
press: 1.00000 atm
elementType: 9 8 8 8 8 6 6 6 6 6 6 6 6 6 6 6 6 6 6 6 6 6 6 6 6 6 6 1 1 1 1 1 1 1 1 1 1 1 1 1 1 1 1 1 1 1 1 1 1 1 1 1 1 1
symmnumber: 1
zpe: 1164054.6 jmol-1
zpe.correction: 0.443365 hartree
zpe.thermalcorrener: 0.468581 hartree
zpe.thermalcorrenthalpy: 0.469525 hartree
zpe.thermalcorrgfe: 0.390663 hartree
zpe.sumelectzpe: -1253.189647 hartree
zpe.sumelectthermal: -1253.164430 hartree
zpe.sumelectthermalent: -1253.163486 hartree
zpe.sumelectthermalfe: -1253.242348 hartree
dipole: -5.4556 -0.2240 3.3773
dipole: 6.4202
quadrupole: -206.0594 -143.6733 -166.4757
quadrupole: -4.8961 24.2817 7.0989
quadrupole: -33.9900 28.3962 5.5938 -4.8961 24.2817 7.0989
hfenergy: -1253.6330116 hartree
pointgroup: C01 [X(C22H27F1O4)]
dipole: 2.1742474 -0.1095595 -1.2809644 debye
polarizability: 304.1854273|-5.0796222|216.2668099|-22.2489734|-4.8750653|200.3804034 unknown
InChI: InChI=1S/C22H27FO4/c1-12-8-16-15-5-4-13-9-14(24)6-7-19(13,2)21(15,23)17(25)10-20(16,3)22(12)18(26)11-27-22/h6-7,9,12,15-17,25H,4-5,8,10-11H2,1-3H3
charge 0 multiplicity 1
54 atoms
F  -1.177299 0.088993 1.327301
O  3.23881 0.156245 1.869699
O  -0.357455 -2.441206 -1.191167
O  5.241421 -1.474595 -0.311438
O  -6.078824 0.000839 1.676281
C  1.972771 -0.400113 -0.295819
C  1.159236 0.926568 -0.186739
C  3.314259 0.095586 0.339716
C  -0.254299 0.823994 -0.793109
C  -1.03199 -0.333267 -0.103398
C  3.560515 1.49596 -0.317446
C  2.128221 2.012557 -0.717511
C  1.227651 -1.481263 0.51397
C  -0.246197 -1.671484 0.069256
C  -2.522526 -0.467272 -0.62817
C  -1.018646 2.164136 -0.627325
C  2.255101 -0.853282 -1.755042
C  4.496766 -0.878429 0.484654
C  -2.514855 2.082727 -1.031192
C  4.384127 -0.809595 2.017409
C  -3.19811 0.889636 -0.394633
C  4.349961 2.464025 0.584099
C  -2.587618 -0.79071 -2.166369
C  -3.232682 -1.610773 0.074354
C  -4.343534 1.010118 0.341183
C  -4.376713 -1.464738 0.797097
C  -5.010396 -0.137257 0.991901
H  1.025629 1.110334 0.900345
H  -0.172608 0.576354 -1.870061
H  4.156229 1.309145 -1.233073
H  2.043372 2.129725 -1.814912
H  1.92774 2.999275 -0.264476
H  1.231247 -1.182522 1.578128
H  1.736264 -2.467591 0.4489
H  -0.767427 -2.232208 0.872215
H  -0.515851 2.943622 -1.229555
H  -0.951559 2.470269 0.433461
H  2.953614 -1.709919 -1.761929
H  2.717206 -0.054522 -2.359715
H  1.32453 -1.170106 -2.251764
H  -2.586573 2.010148 -2.13609
H  -3.032314 3.014589 -0.740889
H  4.083544 -1.750234 2.5171
H  5.24969 -0.359217 2.538253
H  4.495186 3.429467 0.066206
H  3.812244 2.645601 1.529601
H  5.350895 2.065369 0.835195
H  -2.076809 -0.024846 -2.773502
H  -3.647534 -0.819351 -2.473803
H  -2.11837 -1.763435 -2.371198
H  -2.803264 -2.607044 -0.094747
H  0.269672 -3.206009 -1.140397
H  -4.819133 1.987887 0.488126
H  -4.885018 -2.320082 1.25732
