program: Gaussian 09
title: 000062914
version: EM64L-G09RevD.01
frameworkgroup: C1[X(C14H28O5)]
method: RPBEPBE
basis: SDD
operation: Freq
keyword: #pfreq=noraman
keyword: PBEPBE/SDD
title: #p freq=noraman PBEPBE/SDD
converged: YES YES NO NO
title: Mulliken charges:
elementType: O O O O O C C C C C C C C C C C C C C H H H H H H H H H H H H H H H H H H H H H H H H H H H H
charge: -0.316133 -0.450628 -0.433327 -0.449063 -0.436321 0.012696 -0.105102 -0.316481 -0.088020 -0.037302 -0.455652 -0.376619 -0.384433 -0.370851 -0.383752 -0.373123 -0.353318 -0.356778 -0.696579 0.215483 0.198570 0.278852 0.197817 0.235318 0.201182 0.243680 0.194874 0.206056 0.194399 0.195122 0.185442 0.248463 0.194092 0.193204 0.360091 0.337708 0.359494 0.190104 0.189154 0.188297 0.188324 0.351001 0.194491 0.194748 0.209887 0.210060 0.214873
chargesum: 0.00000
title: Mulliken charges with hydrogens summed into heavy atoms:
elementType: O O O O O C C C C C C C C C C C C C C
charge: -0.316133 -0.090537 -0.095618 -0.089569 -0.085320 0.228179 0.093469 -0.037629 0.109797 0.198015 -0.010791 0.024311 0.005087 0.063054 0.003544 0.006136 0.023303 0.032462 -0.061759
polarizability: 2.13793980e+02 3.05017744e+00 1.63117057e+02 -1.06349833e+00 -1.98546771e+00 1.33007141e+02
1716.lowfreq: -14.8131 -5.8009 -0.0011 -0.0008 -0.0003 5.6074 16.8427 27.7037 32.9760
frequency: 15.9462 27.6060 32.6189 44.2784 61.4173 82.5741 88.0551 92.1742 110.2337 111.6678 135.0446 145.6854 147.7978 151.4735 182.3797 199.8186 221.1458 235.2503 240.4234 275.1066 294.1978 303.6051 340.9511 349.8106 365.6262 402.9988 420.3134 423.1517 429.1542 466.0447 475.2831 485.5492 490.8842 547.6079 569.2579 593.3638 603.8322 719.9296 724.2092 739.0105 772.9703 817.0075 862.1051 887.6097 908.1206 915.0994 953.2127 965.5896 978.7007 984.3555 1004.4555 1008.8005 1020.2146 1025.2215 1035.1983 1042.0251 1055.3044 1059.2863 1076.9519 1079.1375 1080.1642 1085.7051 1092.0236 1114.0717 1127.2995 1141.6619 1171.9356 1182.5063 1189.3085 1203.7059 1217.1469 1227.6456 1238.6949 1242.3435 1254.8326 1254.9701 1264.9236 1275.3015 1279.5860 1285.6042 1288.9577 1293.3145 1297.3868 1305.6001 1318.2521 1332.5785 1335.1815 1336.0895 1347.8117 1353.5767 1355.3077 1361.8209 1372.5766 1383.0872 1384.4396 1388.3172 1396.9286 1449.6948 1459.9009 1460.9370 1462.1946 1464.5774 1469.8321 1476.9385 1477.5942 1483.7274 1488.0416 2911.4049 2921.4448 2947.3138 2949.3316 2950.1527 2952.9551 2953.8409 2958.7937 2964.9918 2967.7793 2971.4162 2977.8348 2981.4076 2983.5752 2990.6187 3001.9428 3016.2360 3028.4174 3039.2622 3052.8823 3055.8609 3068.0765 3070.3668 3106.2760 3515.7731 3530.1055 3532.1376 3532.6820
redmass: 3.8719 4.0131 1.8503 3.9551 4.2436 1.6527 3.8407 4.5607 5.0996 3.0380 1.9816 2.2310 3.9832 4.0373 2.5587 3.3056 4.5829 1.1160 4.3111 4.4633 3.4042 3.5776 1.3636 4.1220 2.6808 4.9355 2.2965 1.6177 2.1620 2.7465 1.1718 3.2982 1.2920 3.7391 2.9713 3.1579 3.8168 1.0621 1.0933 1.1815 1.3249 1.6118 1.4822 1.9065 4.2863 1.7850 1.6601 7.7463 4.7062 5.1339 3.2965 1.2084 4.2275 2.9788 2.5215 3.3113 2.4790 3.0673 2.8606 2.4067 2.1886 2.3461 2.2041 2.2089 2.9500 1.6235 1.2898 1.5524 1.4313 1.4578 1.3343 1.4305 1.1181 1.2036 1.2346 1.2812 1.2613 1.2204 1.0469 1.2459 1.1393 1.1382 1.1306 1.2938 1.2478 1.3692 1.3352 1.3844 1.3123 1.6396 1.5852 1.5510 1.4946 1.3155 1.3420 1.2174 1.7136 1.0794 1.0730 1.0693 1.0819 1.0728 1.0806 1.0696 1.0550 1.0878 1.0900 1.0818 1.0816 1.0833 1.0590 1.0588 1.0595 1.0713 1.0596 1.0609 1.0590 1.0364 1.0821 1.0626 1.0961 1.0982 1.1007 1.1019 1.1028 1.1039 1.0857 1.1011 1.1007 1.0993 1.0937 1.0655 1.0657 1.0654 1.0654
irintensity: 0.1413 0.6796 0.2318 0.4476 0.8913 0.1019 0.1829 0.4507 4.8348 0.7487 0.1792 0.0462 0.3728 1.5639 1.0898 3.3769 17.8720 0.0120 6.2506 21.3018 2.1190 3.4272 1.2016 2.5104 7.5259 5.7265 40.2413 77.1973 81.0447 6.9596 221.3348 5.6619 118.9446 11.4357 1.8112 17.8115 12.8996 16.1838 0.3933 3.6438 6.2272 14.3249 14.1829 5.1181 91.4324 26.0305 32.4241 94.7719 99.7268 2.6534 9.4103 17.6149 22.5214 34.7873 35.5406 8.7296 12.4659 15.1677 65.9358 6.1248 5.4423 24.9665 1.7187 34.5844 1.5540 13.0552 6.5443 12.2351 9.7817 38.7008 5.7628 15.2156 26.8817 25.2124 4.9410 1.9019 5.7533 3.9471 2.0694 4.2397 2.6175 0.1590 0.1761 7.9143 13.3472 1.2626 12.2224 11.2075 5.3990 0.7802 2.1253 12.8359 8.3642 5.4868 43.0769 11.3400 10.4773 4.5642 0.0113 0.2538 4.7540 0.3518 1.4355 5.3930 9.0867 3.9337 27.2756 0.9137 54.8936 41.5859 0.5283 0.9303 0.7693 28.1397 16.9363 6.6426 161.3611 37.9664 56.9351 83.4497 1.9010 0.9960 0.9800 0.6968 1.0068 116.3526 9.4022 91.3946 98.0789 56.1040 12.3409 10.3514 3.6757 23.3374 8.4767
temp: 298.150 k
press: 1.00000 atm
elementType: 8 8 8 8 8 6 6 6 6 6 6 6 6 6 6 6 6 6 6 1 1 1 1 1 1 1 1 1 1 1 1 1 1 1 1 1 1 1 1 1 1 1 1 1 1 1 1
symmnumber: 1
zpe: 1071876.9 jmol-1
zpe.correction: 0.408256 hartree
zpe.thermalcorrener: 0.431335 hartree
zpe.thermalcorrenthalpy: 0.432279 hartree
zpe.thermalcorrgfe: 0.353634 hartree
zpe.sumelectzpe: -924.798493 hartree
zpe.sumelectthermal: -924.775415 hartree
zpe.sumelectthermalent: -924.774471 hartree
zpe.sumelectthermalfe: -924.853116 hartree
dipole: -0.9707 -3.1772 2.1282
dipole: 3.9454
quadrupole: -110.6773 -135.2213 -114.6404
quadrupole: 10.0950 -9.9024 -0.4390
quadrupole: 9.5024 -15.0416 5.5392 10.0950 -9.9024 -0.4390
hfenergy: -925.2067497 hartree
pointgroup: C01 [X(C14H28O5)]
dipole: -0.3883004 -1.2664025 0.8092434 debye
polarizability: 213.8186374|2.9085114|163.1685258|-0.7803287|-1.3274321|132.9310141 unknown
InChI: InChI=1S/C14H28O5/c1-2-3-4-5-6-7-8-10-12(16)14(18)13(17)11(9-15)19-10/h10-18H,2-9H2,1H3
charge 0 multiplicity 1
47 atoms
O  -1.665046 0.72154 0.317849
O  -2.457943 -2.824722 -0.505899
O  -5.117408 -1.726285 0.156828
O  -5.308627 1.188665 -0.330486
O  -1.655624 3.504437 -0.063749
C  -1.445704 -0.622485 -0.267054
C  -2.6318 -1.52596 0.147218
C  -3.967083 -0.887644 -0.272676
C  -4.116405 0.555308 0.234493
C  -2.888537 1.37913 -0.200583
C  -0.094568 -1.136034 0.237082
C  1.107296 -0.327418 -0.297123
C  2.459698 -0.840148 0.245651
C  -2.861245 2.798233 0.371123
C  3.668155 -0.023761 -0.264961
C  5.023532 -0.532582 0.275926
C  6.230323 0.29703 -0.217692
C  7.58629 -0.212842 0.322082
C  8.785618 0.625949 -0.170131
H  -1.440747 -0.543821 -1.377869
H  -2.618078 -1.641113 1.257234
H  -4.052111 -0.900256 -1.374846
H  -4.169393 0.546398 1.349248
H  -2.847279 1.418182 -1.310472
H  -0.101616 -1.107802 1.3458
H  -0.00682 -2.197585 -0.062886
H  1.117363 -0.370926 -1.406268
H  0.980221 0.738449 -0.023532
H  2.590117 -1.906004 -0.036458
H  2.442878 -0.812094 1.35542
H  -2.918023 2.746997 1.480191
H  -3.717435 3.374445 -0.010682
H  3.684709 -0.04694 -1.374721
H  3.536708 1.040863 0.021062
H  -3.328007 -3.301709 -0.463933
H  -5.12063 -1.773331 1.15003
H  -6.046885 0.525094 -0.299917
H  5.161987 -1.593425 -0.02109
H  5.001828 -0.521459 1.386003
H  6.093996 1.357398 0.081972
H  6.253099 0.28923 -1.327712
H  -0.88882 2.904585 0.132923
H  7.560674 -0.208641 1.431105
H  7.724176 -1.271012 0.018914
H  8.852565 0.611389 -1.274515
H  8.686037 1.682069 0.144599
H  9.741864 0.242505 0.2313
