program: Gaussian 09
title: 000062897
version: EM64L-G09RevD.01
frameworkgroup: C1[X(C7H8N2)]
method: RPBEPBE
basis: SDD
operation: Freq
keyword: #p
keyword: freq=noraman
keyword: PBEPBE/SDD
title: #p freq=noraman PBEPBE/SDD
converged: YES YES NO NO
title: Mulliken charges:
elementType: N N C C C C C C C H H H H H H H H
charge: -0.024474 0.009704 0.079843 0.431310 -0.801953 -0.383283 -0.293064 -0.666143 -0.267739 0.229156 0.229304 0.233508 0.256612 0.241514 0.217851 0.261553 0.246300
chargesum: 0.00000
title: Mulliken charges with hydrogens summed into heavy atoms:
elementType: N N C C C C C C C
charge: -0.024474 0.009704 0.079843 0.431310 -0.109985 -0.126671 -0.051550 -0.186738 -0.021439
polarizability: 1.28519928e+02 -7.63546454e+00 9.43224940e+01 1.28293695e-02 -4.13456848e-03 4.07476484e+01
1716.lowfreq: -13.3835 -5.6822 -0.0005 -0.0002 0.0006 8.8661 65.8113 128.8354 218.4228
frequency: 65.6622 128.8251 218.4227 221.2780 351.8264 358.1212 417.3382 452.5419 534.0755 564.6015 611.6728 704.4081 770.3347 773.7782 854.9715 928.3214 931.2054 953.6082 969.9748 983.9515 1004.2662 1028.6173 1052.4704 1140.0565 1154.3515 1242.0348 1288.8407 1331.7019 1373.9289 1396.6231 1413.2401 1447.5840 1471.5321 1477.5183 1496.4909 1525.4425 1642.0169 2973.0335 3048.8188 3094.4749 3105.2100 3129.6980 3153.8865 3160.5383 3218.9928
redmass: 3.5247 3.3484 3.4687 1.0552 2.6224 2.9774 6.2982 3.8771 3.4439 2.5096 7.8756 1.3374 6.2065 1.7412 1.6193 1.4765 2.0972 1.4579 4.6576 1.3216 1.4496 2.9369 1.5188 2.3630 2.3201 9.5632 1.5545 2.6054 1.5197 1.2263 1.2695 2.3796 1.0452 1.0701 5.3640 4.6051 5.2375 1.0382 1.0976 1.0978 1.0612 1.0886 1.0913 1.0988 1.1151
irintensity: 0.0518 1.3596 0.5526 1.8716 10.2318 0.2287 7.3482 0.8995 0.6682 4.2890 0.1713 0.2471 0.0806 10.1742 36.1906 2.4478 1.1294 0.4632 9.9079 61.8269 1.0619 5.6986 4.6282 28.9950 1.9150 10.5751 4.7648 11.5781 16.7672 11.6621 25.7132 41.1379 16.4087 20.0314 5.2722 29.7065 14.0056 20.0220 22.0290 23.4255 9.8847 7.0722 44.6217 10.4126 6.1266
temp: 298.150 k
press: 1.00000 atm
elementType: 7 7 6 6 6 6 6 6 6 1 1 1 1 1 1 1 1
symmnumber: 1
zpe: 353893.0 jmol-1
zpe.correction: 0.134791 hartree
zpe.thermalcorrener: 0.142766 hartree
zpe.thermalcorrenthalpy: 0.143710 hartree
zpe.thermalcorrgfe: 0.102029 hartree
zpe.sumelectzpe: -380.359373 hartree
zpe.sumelectthermal: -380.351398 hartree
zpe.sumelectthermalent: -380.350454 hartree
zpe.sumelectthermalfe: -380.392135 hartree
dipole: -0.8312 0.1258 -0.0014
dipole: 0.8407
quadrupole: -45.7849 -55.2296 -55.8160
quadrupole: 6.9207 0.0057 -0.0194
quadrupole: 6.4919 -2.9528 -3.5392 6.9207 0.0057 -0.0194
hfenergy: -380.494164 hartree
pointgroup: C01 [X(C7H8N2)]
dipole: -0.3289303 -0.0343299 -0.0041191 debye
dipolederiv: -0.4406117 -0.0181283 -0.0020877 0.1319762 -0.1860723 0.0073101 0.0155276 0.0067475 -0.2523114 -0.0642642 -0.0449637 -0.0047341 -0.0570753 -0.2004993 0.0072838 -0.0057611 0.0073371 -0.2664656 0.805827 0.0968583 0.0107295 0.3530497 -0.1445614 -0.0271847 0.038247 -0.0280998 0.1191688 -0.09082 -0.1446776 -0.0152263 -0.3730341 0.2198605 0.0290355 -0.0390815 0.0302123 -0.0622077 -0.0437692 0.0569697 0.0056635 0.0723429 -0.1026261 -0.0204505 0.0072172 -0.0208864 0.0911818 -0.2778714 0.0178386 0.0023446 -0.4351639 0.1850067 0.021278 -0.0468738 0.0230159 -0.0296541 0.0125218 0.009682 0.000491 -0.3535983 0.2899724 0.0305094 -0.040423 0.0313263 0.0083536 -0.0657042 -0.0733734 -0.0075534 0.1061192 -0.1315515 0.0242235 0.0115038 0.0238894 -0.3562927 0.2035912 -0.1033466 -0.0087654 0.2939274 -0.1086416 -0.0084542 0.0342606 -0.0099913 -0.0260325 0.0938549 -0.0436204 0.0751896 -0.0098645 -0.0320983 0.0885022 0.0417523 0.1076879 -0.0235028 0.0949099 -0.0259172 -0.0812125 -0.0001307 0.0083926 -0.0815461 -0.0415936 -0.1010731 -0.0651927 -0.154367 0.0240015 0.0013233 -0.0840335 0.0848242 -0.0032346 -0.0099022 -0.0027143 0.1116299 0.0551321 0.0779313 0.0078544 0.1239663 -0.0306564 -0.0161427 0.0127585 -0.0163183 0.1232696 0.009509 0.077171 0.008107 0.1303445 -0.0533056 -0.0192312 0.0138493 -0.0194541 0.1244846 -0.1264979 -0.0099391 -0.0015523 0.0298377 0.101295 -0.0073439 0.0024223 -0.0074849 0.1709539 0.1009602 0.0663702 0.0068348 0.0684144 0.0019898 -0.0198403 0.0070742 -0.0198355 0.1905934 -0.1124007 0.0371437 0.002594 0.0029222 0.0986713 -0.0047143 -0.0009775 -0.0043588 0.1420239 unknown
polarizability: 129.142684|5.9878182|93.0950433|0.8941633|5.6228719|41.3523428 unknown
InChI: InChI=1S/C7H8N2/c1-6(2)7-5-8-3-4-9-7/h3-5H,1H2,2H3
charge 0 multiplicity 1
17 atoms
N  0.392011 -1.232543 -0.115865
N  1.844422 1.206562 0.154823
C  -0.271568 -0.029308 0.013045
C  -1.761863 -0.038011 0.008795
C  -2.484836 1.291456 0.147231
C  0.479015 1.177213 0.145272
C  1.749604 -1.203208 -0.107689
C  -2.437552 -1.215994 -0.116342
C  2.479267 0.004987 0.027865
H  -2.223262 1.98607 -0.674093
H  -2.231642 1.797775 1.098544
H  -3.576657 1.140894 0.12633
H  -0.016571 2.146835 0.246011
H  2.263239 -2.165439 -0.211546
H  -3.532562 -1.245734 -0.120923
H  -1.890891 -2.158924 -0.214805
H  3.573747 0.01847 0.036146
