program: Gaussian 09
title: 000062865
version: EM64L-G09RevD.01
frameworkgroup: C1[X(C19H21N3S)]
method: RPBEPBE
basis: SDD
operation: Freq
keyword: #p
keyword: freq=noraman
keyword: PBEPBE/SDD
title: #p freq=noraman PBEPBE/SDD
converged: YES YES NO NO
title: Mulliken charges:
elementType: S N N N C C C C C C C C C C C C C C C C C C C H H H H H H H H H H H H H H H H H H H H H
charge: 0.246677 -0.282770 -0.088368 -0.025467 -0.046801 -0.454781 -0.366697 -0.712332 0.531513 0.496578 -0.390515 -0.352762 -0.498576 -0.331025 -0.628166 -0.615197 -0.249336 -0.263390 0.434239 -0.236919 -0.414467 -0.251336 -0.274998 0.244020 0.210420 0.227115 0.177820 0.206045 0.230909 0.247901 0.190881 0.277441 0.244597 0.222097 0.232519 0.192905 0.225154 0.223591 0.188260 0.255575 0.249286 0.230510 0.262646 0.235203
chargesum: 0.00000
title: Mulliken charges with hydrogens summed into heavy atoms:
elementType: S N N N C C C C C C C C C C C C C C C C C C C
charge: 0.246677 -0.282770 -0.088368 -0.025467 0.197219 -0.017245 0.017167 -0.042642 0.531513 0.496578 -0.390515 -0.352762 -0.221135 -0.086428 0.019355 0.021808 0.006240 -0.014103 0.434239 -0.006409 -0.151820 -0.016133 -0.274998
polarizability: 2.94064364e+02 6.30920846e+01 2.82951557e+02 -3.15144637e+01 2.08351920e+01 1.77741039e+02
1716.lowfreq: -0.0011 -0.0009 0.0009 4.4891 6.1838 9.7524 21.2109 30.0768 38.6142
frequency: 21.1085 29.9957 38.5803 43.4371 63.8857 83.8350 94.7539 109.7098 132.9841 142.0747 180.3883 187.4165 194.2483 209.8455 213.7061 238.6505 247.2979 279.2565 306.7634 311.8206 326.7319 350.3734 367.3452 378.3199 396.8503 421.9285 431.2922 434.4815 451.1389 469.5610 487.7319 524.2499 528.1094 554.9954 575.1543 607.9901 621.3468 648.4747 671.6298 698.3045 720.1841 731.8024 753.2794 799.7665 825.5556 828.3582 837.3308 849.1726 888.4038 898.0383 918.3913 930.6357 941.2620 952.0329 969.8979 973.7526 1022.4869 1027.2004 1033.3436 1040.4283 1044.4375 1086.7133 1091.8862 1104.0212 1118.8328 1130.3349 1142.6601 1148.5464 1151.1845 1174.9206 1178.2776 1192.8592 1236.8221 1257.8844 1262.4486 1269.6104 1282.8827 1286.0866 1296.6347 1326.5174 1352.4198 1360.9070 1369.0651 1371.0655 1383.8703 1390.1157 1412.1033 1419.1918 1430.1060 1441.1600 1459.9712 1460.7405 1462.5329 1468.2454 1472.8868 1477.4988 1480.3860 1481.5817 1485.7883 1491.2582 1559.8177 1572.9356 1586.9455 1607.6392 2174.3465 2796.9963 2848.0111 2862.6858 2933.0792 2975.0326 2987.8093 3007.5211 3018.5010 3030.8451 3063.4967 3070.8415 3077.3054 3085.7671 3096.8190 3135.0920 3144.2496 3149.1520 3158.0191 3171.3369 3172.5539 3176.1340
redmass: 3.1274 3.7521 5.2883 5.4364 3.1823 5.6016 3.0737 5.7171 3.7289 3.6847 4.3346 2.7157 1.4366 2.7644 1.2407 1.1181 4.9179 5.2680 3.9809 3.8118 2.9352 8.1222 1.9998 6.9888 4.3152 4.0392 2.7617 2.6870 2.6926 5.2793 4.7641 3.8344 3.9689 6.5835 5.1032 6.1048 6.2946 4.7099 6.3400 6.0110 4.0825 3.3930 1.3739 5.5314 4.2523 1.3675 2.6903 1.4120 1.4910 1.7535 1.3167 1.3905 2.1975 1.3605 2.2981 1.3321 6.4753 4.0216 1.6829 2.2818 2.1215 1.3438 3.3103 1.7840 2.0097 1.6375 1.8272 1.5570 1.8796 1.2341 1.5149 2.1350 1.7360 2.2134 1.8857 1.8382 1.7838 1.5040 1.3279 1.8398 1.4175 1.4294 7.7775 1.3730 5.0076 1.3368 2.9734 1.1441 2.3885 1.1537 1.2785 1.8132 1.0679 1.0587 1.0780 1.0682 1.3622 1.6728 1.0658 1.1211 7.2819 6.0809 6.6025 6.7790 12.6309 1.0700 1.0570 1.0570 1.0697 1.0389 1.0826 1.0851 1.0722 1.0722 1.0918 1.0957 1.1010 1.1006 1.0998 1.0852 1.0900 1.0890 1.0939 1.0918 1.1007 1.0967
irintensity: 0.6907 0.2190 0.2675 0.3077 0.4214 3.9113 0.2013 1.9570 1.8626 0.4341 0.3641 0.1220 0.9346 4.4884 0.4196 0.2981 1.4812 0.6942 2.5988 2.0569 5.0691 5.5099 1.1190 0.9950 2.2144 4.1001 2.9620 2.7200 3.1193 0.9112 9.1302 7.5022 0.2448 2.0592 3.1694 1.2531 11.1745 0.7340 4.7398 2.0993 1.1021 12.8578 87.5006 14.7152 9.1683 35.0684 1.3245 0.5396 37.8896 7.7162 2.3159 1.8760 7.1720 0.3481 18.7485 0.2413 33.1101 38.8224 17.6541 21.3851 28.7807 3.9202 16.6423 18.4480 11.3656 15.5486 14.4225 7.5951 1.4195 3.1812 8.3375 26.4046 55.0869 23.7489 3.6116 17.7585 5.9006 4.8894 31.0384 82.4969 2.0652 4.1258 24.5395 10.4602 12.9174 20.3222 39.9898 4.1623 12.2354 1.0948 104.0248 209.3938 7.2795 8.0290 19.7368 23.9786 5.3640 8.8202 17.2735 11.1773 41.6898 9.7715 4.0814 40.9233 69.4355 91.2961 76.0765 186.1413 54.8440 17.4595 4.4580 31.3968 45.9847 34.9344 7.5520 38.5345 34.5678 54.4071 18.2788 1.8911 6.4839 2.2042 20.0050 5.4665 22.2355 1.1959
temp: 298.150 k
press: 1.00000 atm
elementType: 16 7 7 7 6 6 6 6 6 6 6 6 6 6 6 6 6 6 6 6 6 6 6 1 1 1 1 1 1 1 1 1 1 1 1 1 1 1 1 1 1 1 1 1
symmnumber: 1
zpe: 932695.3 jmol-1
zpe.correction: 0.355245 hartree
zpe.thermalcorrener: 0.377460 hartree
zpe.thermalcorrenthalpy: 0.378404 hartree
zpe.thermalcorrgfe: 0.302717 hartree
zpe.sumelectzpe: -1297.239965 hartree
zpe.sumelectthermal: -1297.217749 hartree
zpe.sumelectthermalent: -1297.216805 hartree
zpe.sumelectthermalfe: -1297.292493 hartree
dipole: -1.5559 -3.9290 -0.1307
dipole: 4.2279
quadrupole: -138.1480 -152.3322 -148.8641
quadrupole: -12.4000 2.4271 18.5147
quadrupole: 8.3001 -5.8841 -2.4160 -12.4000 2.4271 18.5147
hfenergy: -1297.5952095 hartree
pointgroup: C01 [X(C19H21N3S1)]
dipole: -1.0447404 -1.2925396 -0.0687837 debye
polarizability: 328.6444401|49.3735409|247.0047934|-23.8835709|30.2374733|179.107726 unknown
InChI: InChI=1S/C19H21N3S/c1-14(12-21(2)3)13-22-16-6-4-5-7-18(16)23-19-9-8-15(11-20)10-17(19)22/h4-10,14H,12-13H2,1-3H3
charge 0 multiplicity 1
44 atoms
S  -2.417573 1.269144 1.79171
N  -0.77926 -0.32826 -0.243234
N  3.41961 -3.029615 0.56322
N  3.666007 3.515776 -1.505315
C  1.275847 -1.693092 0.340589
C  0.150482 -1.395175 -0.687934
C  2.27275 -2.689062 -0.306797
C  0.700572 -2.234997 1.664446
C  -0.272199 0.979472 -0.00561
C  -2.192271 -0.524651 -0.368967
C  -0.95959 1.874244 0.86708
C  -3.094524 0.179252 0.474384
C  0.918179 1.437212 -0.624734
C  -2.741588 -1.397747 -1.346826
C  4.341576 -1.897119 0.78748
C  4.133847 -4.23456 0.093881
C  -0.485178 3.18193 1.092524
C  -4.48813 0.016661 0.358334
C  1.419295 2.740633 -0.364834
C  -4.136687 -1.593143 -1.439197
C  0.712336 3.622937 0.494597
C  -5.017836 -0.889793 -0.588934
C  2.645786 3.165753 -0.986967
H  1.812957 -0.748867 0.554566
H  0.587315 -1.16119 -1.684193
H  -0.445841 -2.315832 -0.806172
H  2.618361 -2.271598 -1.293346
H  1.732672 -3.631862 -0.529284
H  0.029844 -1.49724 2.139776
H  1.521606 -2.480565 2.358958
H  0.121688 -3.163192 1.490084
H  1.465826 0.789297 -1.313341
H  -2.08226 -1.914584 -2.050415
H  5.163198 -2.220299 1.450715
H  3.820013 -1.063122 1.287117
H  4.794249 -1.5055 -0.15951
H  3.429754 -5.083151 0.027047
H  4.92353 -4.50299 0.818346
H  4.617715 -4.1053 -0.908256
H  -1.046462 3.848869 1.754561
H  -5.15377 0.585788 1.01581
H  -4.532742 -2.283054 -2.192101
H  1.096633 4.628244 0.687351
H  -6.100237 -1.033353 -0.664209
