program: Gaussian 09
title: 000062852
version: EM64L-G09RevD.01
frameworkgroup: C1[X(C14H28O6)]
method: RPBEPBE
basis: SDD
operation: Freq
keyword: #pfreq=noraman
keyword: PBEPBE/SDD
title: #p freq=noraman PBEPBE/SDD
converged: YES YES NO NO
title: Mulliken charges:
elementType: O O O O O O C C C C C C C C C C C C C C H H H H H H H H H H H H H H H H H H H H H H H H H H H H
charge: -0.263387 -0.243521 -0.432526 -0.416372 -0.440865 -0.441807 -0.190915 -0.204403 -0.080673 0.019677 0.022288 -0.379892 -0.267757 -0.401152 -0.375303 -0.377550 -0.371582 -0.352768 -0.356555 -0.696320 0.262272 0.201107 0.214015 0.238292 0.186205 0.159699 0.222451 0.187662 0.217233 0.210599 0.214725 0.190335 0.190266 0.341020 0.335356 0.193376 0.195695 0.361114 0.188514 0.189903 0.188991 0.187750 0.350835 0.194350 0.195015 0.210212 0.209580 0.214813
chargesum: 0.00000
title: Mulliken charges with hydrogens summed into heavy atoms:
elementType: O O O O O O C C C C C C C C C C C C C C
charge: -0.263387 -0.243521 -0.091506 -0.081016 -0.079751 -0.090972 0.071357 -0.003296 0.133342 0.257969 0.208493 0.002258 0.137139 0.024172 0.005298 0.011521 0.006834 0.023973 0.032810 -0.061716
polarizability: 2.23968350e+02 4.79554278e-01 1.68875817e+02 -2.82058622e+00 6.00281180e-01 1.37050749e+02
1716.lowfreq: -33.7824 -7.8476 -0.0013 -0.0005 0.0015 1.6838 4.7210 15.4081 24.9426
frequency: -33.5221 15.1604 24.8219 30.7962 40.1648 50.1329 63.9098 71.5444 79.6115 96.4455 112.4329 123.7244 131.1479 136.0086 138.2389 143.4997 150.5449 195.3265 216.0346 231.6376 248.7499 257.8228 271.2294 272.7933 281.0425 299.3764 336.8561 356.8977 380.8196 403.6282 445.4737 447.1772 466.3254 484.5652 500.7994 555.5557 571.1814 598.1949 608.4624 720.7224 729.3953 753.3295 799.0426 852.6934 862.7093 887.2438 902.9436 921.6890 937.7185 940.9492 960.9176 980.8945 991.3076 1008.9800 1012.0434 1024.3355 1031.3173 1036.4209 1045.7887 1048.2425 1056.1901 1077.0757 1080.2388 1087.0547 1091.6598 1105.2060 1123.3114 1127.8472 1146.9527 1159.6551 1186.7270 1200.3211 1209.0627 1220.3208 1221.9309 1231.3800 1245.3834 1251.3121 1258.6602 1263.2231 1268.0445 1273.7761 1276.7947 1283.1123 1292.2153 1296.4995 1300.9933 1314.8081 1325.7179 1333.3011 1338.4052 1342.1928 1354.6425 1357.4469 1368.2931 1375.4075 1389.6388 1396.3513 1412.8338 1421.5871 1453.5683 1461.4991 1462.4361 1467.1748 1470.5633 1476.3099 1477.1191 1482.1191 1487.6268 1490.8303 2905.9012 2914.6227 2922.4911 2946.1157 2950.1926 2952.5146 2954.6146 2962.1035 2964.9313 2967.9489 2969.8875 2971.6739 2984.2704 2991.9799 2992.4594 3004.2001 3007.5727 3018.9196 3023.5042 3037.9338 3048.4268 3061.7818 3068.2702 3070.2647 3511.2926 3555.6872 3561.5646 3584.0234
redmass: 1.7187 4.9417 4.9956 1.5765 4.3991 3.9900 2.9212 2.0357 3.0868 3.5200 1.8778 2.5034 2.1692 1.7362 1.8361 4.3088 1.9680 4.1196 3.0537 1.1160 4.3700 4.4004 4.0669 1.3775 3.8696 4.7859 4.5041 4.5213 3.8226 6.1757 3.2167 3.2600 2.2445 1.5318 3.9157 3.7245 3.4681 3.3143 4.6845 1.0619 1.0817 1.1111 1.1614 2.9336 1.2445 2.0249 4.7175 5.7906 1.5246 2.6218 5.9212 6.3631 4.4475 1.1364 3.3996 3.8921 2.8492 4.0885 3.1362 2.9884 2.4779 2.4329 2.2674 2.2945 2.6142 3.0281 3.1308 3.0076 1.4144 1.1635 1.6928 1.3054 1.3098 1.3245 1.3897 1.1706 1.1941 1.1485 1.2678 1.2879 1.1913 1.2674 1.0636 1.0945 1.1179 1.1027 1.2634 1.2667 1.2975 1.3359 1.3864 1.3910 1.6491 1.5973 1.3629 1.5050 1.2179 1.3010 1.5623 1.6349 1.0846 1.0713 1.0743 1.0695 1.0796 1.0793 1.0429 1.0832 1.0865 1.0960 1.0828 1.0649 1.0810 1.0607 1.0588 1.0588 1.0592 1.0591 1.0837 1.0586 1.0839 1.0365 1.0966 1.0809 1.0767 1.1019 1.0961 1.1002 1.1039 1.1048 1.0849 1.1051 1.1006 1.0993 1.0650 1.0661 1.0663 1.0669
irintensity: 28.8711 0.5871 0.3704 0.5032 0.6348 2.4175 1.5212 1.4901 0.5893 1.0809 1.8538 6.9712 79.8545 55.7041 59.0177 3.5197 0.4062 7.3078 9.9960 0.0049 9.9454 27.4873 21.6023 65.2374 61.4013 28.4627 9.6975 3.3526 5.0571 0.8242 5.1786 2.9818 33.7976 152.2673 3.3166 5.4224 13.3068 20.7943 20.3840 13.9838 0.0461 4.5242 0.0450 48.0360 1.2101 4.8989 15.5433 229.2799 33.3865 68.8778 161.9487 46.1751 5.0732 6.7810 103.3471 21.6071 46.0773 25.4142 22.6612 38.6376 46.6141 1.1360 1.4493 4.0221 60.2049 5.8348 119.6143 2.5726 3.6588 30.0347 0.2345 0.1268 50.1834 2.1775 0.4686 18.4818 55.3734 28.1707 0.3421 0.6693 1.3952 2.9797 0.4440 1.0573 0.1564 0.2153 11.4824 34.3502 6.7970 8.1584 0.7984 13.1938 0.3936 0.3116 14.8656 16.0667 11.4112 11.0999 5.9662 2.8976 9.3428 0.0144 0.0128 0.1892 0.5351 1.7986 12.3164 0.3261 9.2489 23.7016 36.3422 95.7928 48.5393 28.2497 0.3044 9.0903 1.3956 28.6729 35.1068 148.2369 43.8424 36.6850 0.3889 18.8876 24.1503 1.9070 45.3663 11.8462 4.2055 94.8136 22.4757 93.1451 103.2538 55.2115 17.6744 3.5022 9.5856 6.5218
temp: 298.150 k
press: 1.00000 atm
elementType: 8 8 8 8 8 8 6 6 6 6 6 6 6 6 6 6 6 6 6 6 1 1 1 1 1 1 1 1 1 1 1 1 1 1 1 1 1 1 1 1 1 1 1 1 1 1 1 1
symmnumber: 1
zpe: 1076560.1 jmol-1
zpe.correction: 0.410040 hartree
zpe.thermalcorrener: 0.434458 hartree
zpe.thermalcorrenthalpy: 0.435402 hartree
zpe.thermalcorrgfe: 0.352712 hartree
zpe.sumelectzpe: -999.912093 hartree
zpe.sumelectthermal: -999.887675 hartree
zpe.sumelectthermalent: -999.886731 hartree
zpe.sumelectthermalfe: -999.969421 hartree
dipole: -0.6595 3.8665 2.8613
dipole: 4.8551
quadrupole: -118.2194 -118.7635 -120.8021
quadrupole: -12.6577 -18.8369 3.5051
quadrupole: 1.0422 0.4982 -1.5404 -12.6577 -18.8369 3.5051
hfenergy: -1000.322133 hartree
pointgroup: C01 [X(C14H28O6)]
dipole: -0.2750607 -1.5578682 -1.0705247 debye
polarizability: 224.0248683|-0.4632528|168.8812691|1.7382747|-0.4694084|136.9887786 unknown
InChI: InChI=1S/C14H28O6/c1-2-3-4-5-6-7-8-19-14-13(18)12(17)11(16)10(9-15)20-14/h10-18H,2-9H2,1H3
charge 0 multiplicity 1
48 atoms
O  -2.251192 -0.789375 -0.246795
O  -0.54921 0.827208 -0.188668
O  -5.185631 2.248094 -0.185765
O  -5.970664 -0.519673 0.357487
O  -2.511011 2.843205 0.570568
O  -3.131949 -3.561237 0.698961
C  -4.275972 1.180213 0.270306
C  -4.654091 -0.225452 -0.220355
C  -2.830711 1.589107 -0.105191
C  -3.561909 -1.229282 0.25711
C  -1.826084 0.518864 0.338479
C  -3.763018 -2.651257 -0.262328
C  0.556962 0.027524 0.392364
C  1.862718 0.577633 -0.18313
C  3.102773 -0.180255 0.344005
C  4.428708 0.384261 -0.213885
C  5.676381 -0.378721 0.28508
C  7.003035 0.197084 -0.259455
C  8.251059 -0.577466 0.222527
C  9.572161 0.009244 -0.320307
H  -4.378687 1.202376 1.371087
H  -4.690345 -0.246381 -1.336015
H  -2.747877 1.694889 -1.209222
H  -3.576416 -1.254889 1.369217
H  -1.812721 0.417886 1.450677
H  -4.848318 -2.888758 -0.346593
H  -3.302147 -2.722508 -1.268586
H  0.533629 0.130407 1.499268
H  0.412249 -1.038752 0.130691
H  1.82044 0.509825 -1.287394
H  1.937794 1.65279 0.069206
H  3.125383 -0.133291 1.452999
H  3.022886 -1.255383 0.0787
H  -5.471111 2.06373 -1.116465
H  -6.283771 -1.402943 0.035657
H  4.400486 0.355153 -1.323134
H  4.516241 1.454665 0.066203
H  -3.289146 3.445261 0.424692
H  5.593611 -1.44689 -0.006793
H  5.698199 -0.361137 1.39502
H  7.093994 1.261143 0.044226
H  6.977317 0.192913 -1.36945
H  -2.913802 -4.419267 0.257934
H  8.161763 -1.639248 -0.08623
H  8.273536 -0.577751 1.331607
H  9.702727 1.058694 0.005218
H  9.585252 -0.001423 -1.426697
H  10.447882 -0.565525 0.033672
