program: Gaussian 09
title: 000062850
version: EM64L-G09RevD.01
frameworkgroup: C1[X(C19H38O)]
method: RPBEPBE
basis: SDD
operation: Freq
keyword: #pfreq=noraman
keyword: PBEPBE/SDD
title: #p freq=noraman PBEPBE/SDD
converged: YES YES NO NO
title: Mulliken charges:
elementType: O C C C C C C C C C C C C C C C C C C C H H H H H H H H H H H H H H H H H H H H H H H H H H H H H H H H H H H H H H
charge: -0.315930 -0.086670 -0.090032 -0.429696 -0.413728 -0.389147 -0.376618 -0.376332 -0.391269 -0.386098 -0.375883 -0.384225 -0.021469 -0.382018 -0.372698 -0.716528 -0.715166 -0.353365 -0.356697 -0.696434 0.216243 0.216184 0.211100 0.206645 0.191030 0.208617 0.195113 0.207140 0.193010 0.222494 0.199715 0.193168 0.199516 0.191265 0.195505 0.193629 0.188097 0.193350 0.194507 0.193487 0.192079 0.192487 0.191861 0.189474 0.189838 0.210507 0.220736 0.203269 0.213682 0.211139 0.205567 0.187608 0.187693 0.194954 0.194842 0.209673 0.209545 0.215230
chargesum: 0.00000
title: Mulliken charges with hydrogens summed into heavy atoms:
elementType: O C C C C C C C C C C C C C C C C C C C
charge: -0.315930 0.129574 0.126152 -0.011952 -0.014081 0.013106 0.038887 0.016551 -0.000488 0.003036 0.005564 0.003769 0.170610 0.002331 0.006614 -0.082015 -0.084777 0.021936 0.033099 -0.061986
polarizability: 2.60641429e+02 -6.07733943e-01 1.97752947e+02 4.59892715e-01 1.95758564e+00 1.75000475e+02
1716.lowfreq: -11.9853 -1.9720 -0.0021 -0.0007 0.0015 2.4809 8.6097 21.1097 26.2143
frequency: 8.5565 20.7363 26.1661 29.5944 36.7281 41.9081 58.2235 68.9412 70.3668 73.6708 92.8921 103.1371 111.2968 116.3302 132.6238 146.0628 146.5669 149.3578 177.8898 179.4102 205.1172 211.5157 237.5534 239.2685 255.8251 282.1689 319.4674 332.5861 367.5216 389.8228 406.0265 435.1362 445.6190 471.3550 487.3342 503.0946 542.7015 685.6719 719.0917 722.0598 727.5509 730.9196 751.6156 772.0771 786.6329 796.4642 813.7302 845.1124 872.3902 888.3700 905.6474 912.3207 915.1062 942.8624 953.9067 960.9564 980.0122 996.9577 1000.1324 1006.8786 1020.0836 1023.9671 1031.5888 1042.1057 1054.9353 1057.8054 1070.5649 1075.7732 1078.9791 1079.0523 1080.6540 1090.3452 1121.9232 1134.9544 1144.8638 1163.6141 1176.4897 1183.9597 1190.8391 1205.8370 1208.5216 1229.7696 1236.4041 1239.1758 1248.2617 1258.4039 1264.9047 1272.5177 1279.1346 1280.4175 1287.4562 1288.9487 1289.7470 1292.1303 1298.7739 1299.2981 1300.1150 1315.0141 1326.0259 1330.5360 1342.3162 1345.9220 1353.4276 1354.9676 1356.9026 1357.2180 1374.3675 1375.1945 1389.3115 1392.1947 1430.3101 1447.2030 1454.8876 1459.6603 1459.7440 1463.0767 1464.2539 1465.3633 1468.1076 1468.7937 1471.7584 1473.1467 1477.8688 1478.7143 1481.0406 1481.9456 1483.9333 1487.9525 1489.0299 1490.2003 2945.7884 2950.1161 2950.3705 2951.7689 2952.4446 2953.4860 2956.5672 2956.8661 2960.6758 2963.4572 2964.9196 2965.4237 2968.4248 2968.5441 2969.9697 2971.9213 2981.9029 2985.4278 2987.0937 2991.9397 2992.8034 3001.1003 3011.3629 3012.8643 3022.5702 3030.4765 3033.1532 3040.2281 3042.3622 3049.8655 3056.9512 3057.3612 3064.0047 3067.1382 3068.5415 3070.1946 3070.5177 3074.6992
redmass: 4.0887 2.6397 3.5133 3.4777 2.4713 1.9386 3.6858 2.9208 1.7380 2.0822 3.5958 1.9993 1.9106 2.3247 1.9483 1.9685 2.8809 2.3705 3.0131 4.2422 1.1012 3.1057 1.1392 1.1519 2.8952 2.9305 2.7857 4.2992 2.8261 2.3424 2.6074 2.4114 3.1105 3.0636 2.9414 3.1469 2.5477 4.1719 1.0593 1.0701 1.1122 1.1046 1.1563 1.3273 2.1949 1.5131 2.5173 1.2547 1.5767 1.9157 1.2655 1.2018 2.2796 1.8057 1.5164 1.2881 3.6866 3.3398 1.5351 2.0053 1.4680 2.9728 1.5767 2.3928 2.5636 2.7498 1.6521 2.4320 2.2035 2.1690 2.1687 1.5832 2.7406 2.1863 1.6910 1.9946 1.7534 1.8245 1.6854 1.2685 1.5216 1.2854 1.3403 1.3254 1.3108 1.3504 1.2779 1.2791 1.1317 1.1177 1.1709 1.0568 1.1653 1.0852 1.1090 1.1337 1.2756 1.3629 1.3702 1.4214 1.4565 1.4657 1.6686 1.5962 1.5866 1.6369 1.4580 1.2368 1.2164 1.2171 2.4331 1.1957 1.0717 1.0717 1.0727 1.0640 1.0747 1.0821 1.0789 1.0452 1.0609 1.0829 1.0451 1.0825 1.0667 1.0853 1.0909 1.0960 1.0516 1.0954 1.0630 1.0581 1.0582 1.0588 1.0685 1.0589 1.0592 1.0704 1.0592 1.0612 1.0584 1.0365 1.0614 1.0602 1.0366 1.0367 1.0956 1.0836 1.0795 1.0970 1.0968 1.1001 1.1023 1.0988 1.1036 1.0969 1.1035 1.0948 1.1003 1.0962 1.0992 1.0977 1.0990 1.0992 1.1006 1.0966 1.0993 1.0982
irintensity: 0.0250 0.0183 0.0068 0.2277 0.6699 0.1918 0.4161 0.2130 0.0643 0.7246 0.6686 0.2791 0.0939 0.2362 0.1825 0.0402 0.3925 0.1660 1.0089 1.1463 0.1017 0.3616 0.0573 0.0828 1.4011 0.5484 0.8284 4.5201 0.6787 0.3339 4.7013 2.3671 4.3796 0.3880 2.1226 5.9769 3.6956 5.1380 17.6053 0.7263 7.4161 7.0851 0.2871 0.8525 20.1173 12.4621 2.4048 0.9493 3.1014 4.6047 2.6838 3.9597 5.0641 0.8515 0.8184 1.2835 0.7168 1.9372 4.0637 2.2817 1.4671 2.7175 1.6051 0.9664 0.7038 1.3946 5.6554 0.4186 0.3132 0.2812 0.2067 6.3844 11.3180 2.2724 2.9445 1.0444 10.8415 0.8033 4.2342 18.3930 0.4160 7.6015 0.3870 2.1500 3.1246 2.1542 0.1343 0.3629 0.0367 0.2231 0.0641 0.3465 0.3225 0.2668 0.0858 0.0691 0.8626 2.3761 0.5508 3.3062 1.1992 0.8447 0.9731 0.9769 0.4067 0.3109 16.4416 23.3844 11.1443 14.2936 2.8385 5.8394 0.7416 0.1074 0.0050 0.0166 0.2149 0.5821 0.1642 2.2501 3.4600 1.7960 11.6926 1.3541 10.7522 6.3125 4.0032 3.5790 26.4294 40.4272 7.7657 0.0332 0.0532 0.0917 2.8375 0.7597 0.6068 25.1501 3.3143 1.8432 97.2142 29.8788 119.4785 174.5605 32.2129 34.2148 0.1379 15.2680 21.7306 1.4112 2.9234 1.5094 0.5650 17.2220 7.1959 23.2555 1.7755 57.1592 167.7762 7.8368 9.3490 95.8223 84.6071 66.8652 93.7116 134.5107 55.8983 57.2987
temp: 298.150 k
press: 1.00000 atm
elementType: 8 6 6 6 6 6 6 6 6 6 6 6 6 6 6 6 6 6 6 6 1 1 1 1 1 1 1 1 1 1 1 1 1 1 1 1 1 1 1 1 1 1 1 1 1 1 1 1 1 1 1 1 1 1 1 1 1 1
symmnumber: 1
zpe: 1389373.1 jmol-1
zpe.correction: 0.529184 hartree
zpe.thermalcorrener: 0.555941 hartree
zpe.thermalcorrenthalpy: 0.556885 hartree
zpe.thermalcorrgfe: 0.466389 hartree
zpe.sumelectzpe: -820.331825 hartree
zpe.sumelectthermal: -820.305068 hartree
zpe.sumelectthermalent: -820.304124 hartree
zpe.sumelectthermalfe: -820.394620 hartree
dipole: -1.5508 -1.4664 -1.3318
dipole: 2.5158
quadrupole: -135.6462 -136.5220 -129.4578
quadrupole: -10.3043 -5.3541 -5.6250
quadrupole: -1.7709 -2.6467 4.4175 -10.3043 -5.3541 -5.6250
hfenergy: -820.861009 hartree
pointgroup: C01 [X(C19H38O1)]
dipole: 0.6325682 0.5351217 -0.5414379 debye
polarizability: 260.4702253|-3.3198071|197.7918653|-0.72139|-2.5736789|175.1327597 unknown
InChI: InChI=1S/C19H38O/c1-4-5-6-7-8-9-10-11-15-18-19(20-18)16-13-12-14-17(2)3/h17-19H,4-16H2,1-3H3
charge 0 multiplicity 1
58 atoms
O  -3.00551 -3.077476 0.549032
C  -1.657749 -2.922178 -0.129105
C  -2.849813 -2.183093 -0.672229
C  -0.539898 -2.28656 0.677289
C  -3.12725 -0.706011 -0.46921
C  0.648269 -1.854177 -0.217384
C  -4.639191 -0.421588 -0.299532
C  1.850235 -1.32511 0.59651
C  -4.952721 1.078885 -0.108192
C  3.040525 -0.888561 -0.286432
C  -6.464552 1.355347 0.05713
C  4.256413 -0.39508 0.530051
C  -6.830852 2.831663 0.368389
C  5.44915 0.042183 -0.349627
C  6.67188 0.515159 0.469025
C  -6.453495 3.786103 -0.790463
C  -8.337456 2.954833 0.700113
C  7.866381 0.951155 -0.409059
C  9.091085 1.41806 0.410995
C  10.279701 1.851037 -0.474385
H  -1.355834 -3.828413 -0.679037
H  -3.331323 -2.617898 -1.563004
H  -0.18861 -3.021587 1.429323
H  -0.923762 -1.418679 1.243988
H  -2.741011 -0.148759 -1.348972
H  -2.582919 -0.332203 0.41766
H  0.978594 -2.714767 -0.8361
H  0.308836 -1.072447 -0.927548
H  -5.187983 -0.801134 -1.186737
H  -5.011881 -0.997055 0.570588
H  1.523134 -0.468955 1.222649
H  2.187174 -2.113822 1.301458
H  -4.555323 1.645827 -0.974542
H  -4.413415 1.45454 0.787053
H  2.710955 -0.084044 -0.976854
H  3.352157 -1.739626 -0.927744
H  -6.999895 1.039255 -0.863948
H  -6.852437 0.714375 0.876501
H  3.945953 0.453732 1.17482
H  4.585952 -1.202198 1.217589
H  -6.254715 3.138984 1.26815
H  5.124779 0.858628 -1.028544
H  5.751405 -0.802937 -1.003216
H  6.995623 -0.302021 1.147477
H  6.370624 1.360118 1.12332
H  -6.746231 4.826781 -0.556379
H  -5.367388 3.781797 -0.993224
H  -6.975213 3.490149 -1.721788
H  -8.615641 2.306638 1.552321
H  -8.608156 3.995387 0.95987
H  -8.95422 2.653154 -0.168915
H  8.166868 0.107877 -1.065887
H  7.545924 1.771647 -1.085083
H  9.410527 0.598065 1.086333
H  8.789804 2.260436 1.066967
H  10.620576 1.015797 -1.115036
H  9.993388 2.68748 -1.139886
H  11.140731 2.183188 0.134561
