program: Gaussian 09
title: 000073452
version: EM64L-G09RevD.01
frameworkgroup: C1[X(C12H20N2O7)]
method: RPBEPBE
basis: SDD
operation: Freq
keyword: #p
keyword: freq=noraman
keyword: PBEPBE/SDD
title: #p freq=noraman PBEPBE/SDD
converged: YES YES NO NO
title: Mulliken charges:
elementType: O O O O O O O N N C C C C C C C C C C C C H H H H H H H H H H H H H H H H H H H H
charge: -0.492572 -0.480235 -0.498214 -0.513680 -0.478838 -0.440292 -0.447773 -0.016745 -0.145128 -0.110786 -0.137129 -0.181618 -0.087415 -0.559021 -0.129905 0.172983 0.375507 -0.329302 -0.333517 -0.417927 -0.468278 0.225583 0.241070 0.269005 0.218246 0.228382 0.257959 0.239046 0.242638 0.206403 0.204401 0.210111 0.308878 0.258855 0.380689 0.388440 0.365582 0.396420 0.374373 0.349054 0.354749
chargesum: 0.00000
title: Mulliken charges with hydrogens summed into heavy atoms:
elementType: O O O O O O O N N C C C C C C C C C C C C
charge: -0.111883 -0.091796 -0.132632 -0.117260 -0.104465 -0.091237 -0.093024 -0.016745 -0.145128 0.114796 0.103942 0.087387 0.130831 -0.072680 0.109141 0.172983 0.375507 0.119739 0.080995 -0.109049 -0.209423
polarizability: 2.40072693e+02 5.47464116e+00 1.61156885e+02 4.79047916e-01 5.42498534e-01 1.15175871e+02
1716.lowfreq: -7.3478 -1.5069 0.0007 0.0008 0.0009 7.2704 18.6111 30.9648 39.6587
frequency: 18.3319 30.8501 39.6428 48.1981 59.6467 78.8700 91.7811 95.2516 119.9450 126.2673 129.6516 154.0330 173.5841 224.9743 244.3864 255.8257 277.8165 290.0222 308.3728 317.3175 319.8167 324.5723 351.3544 363.9603 404.8152 437.0665 464.9688 490.5109 497.2086 503.3585 519.2488 520.7329 538.9799 557.4031 567.5100 598.3539 635.4735 646.4804 677.0187 695.3282 772.2268 789.1913 792.2866 809.4961 812.4418 844.2298 856.7825 886.7859 916.0108 946.0965 966.5218 969.4286 992.4468 999.0475 1001.4426 1020.4090 1025.3578 1032.8669 1039.4110 1047.2606 1059.7027 1094.9957 1103.6135 1148.4106 1165.6303 1184.3727 1194.0653 1200.8741 1214.7088 1225.9135 1236.2705 1240.1493 1248.7112 1255.4951 1272.5442 1277.2543 1287.0755 1290.1845 1303.6724 1309.1403 1320.4072 1327.0091 1342.4160 1349.3212 1360.6378 1375.4076 1382.1035 1390.0436 1393.3841 1401.4969 1426.7615 1436.8365 1466.0750 1468.6668 1472.4900 1495.6397 1553.3897 2947.7663 2950.0181 2959.4255 2965.8306 2972.4844 2984.2950 3038.0248 3048.8311 3056.8974 3059.9103 3096.0800 3139.6802 3149.0454 3197.3675 3432.7340 3474.5693 3494.7735 3502.2585 3525.5119 3598.4078
redmass: 5.7175 6.3684 6.9931 6.0336 4.8357 6.5759 3.7673 6.0575 2.9529 4.3573 4.6034 5.5063 4.7441 5.4109 4.6562 3.4199 1.4269 4.6465 4.7255 4.7255 4.6725 4.0444 4.1751 4.1017 3.4518 3.7532 3.4470 2.9851 1.3850 2.4337 1.1208 2.2795 1.4932 2.4894 1.2121 4.1065 1.1603 6.7493 3.7588 4.1789 2.0467 1.5723 3.9455 3.2746 3.3288 3.0748 4.3499 2.9001 1.6705 2.0301 1.5795 2.4707 3.8981 3.7436 4.6254 3.6317 3.8218 2.0175 3.3655 2.6557 3.0058 2.5453 2.5559 1.2099 1.0975 1.5739 1.2419 1.6172 1.6261 1.3578 1.7457 3.4633 1.4517 1.6589 1.3872 1.4011 1.3144 1.2254 1.1861 1.2695 1.1925 1.2013 1.3236 1.6312 1.3409 1.4795 1.2170 1.6014 1.3962 1.3004 1.4124 1.1854 2.0973 1.2338 1.0942 7.7501 5.8324 1.0822 1.0839 1.0651 1.0825 1.0694 1.0611 1.0873 1.0988 1.0862 1.0974 1.0963 1.0918 1.0676 1.0940 1.0643 1.0645 1.0647 1.0647 1.0648 1.0669
irintensity: 0.6975 1.5595 0.3562 0.9417 9.5822 0.5103 0.7670 8.6861 1.5497 6.7392 6.1294 3.0591 2.6334 6.6484 20.4475 17.5028 28.9664 11.7508 3.6525 2.7903 2.2097 2.6389 5.6595 7.1179 9.6880 6.1974 24.5949 3.6633 160.6743 26.7503 50.4332 17.9132 181.5266 46.9196 109.1880 44.7804 239.8045 3.8252 41.4659 41.6984 33.7075 113.1557 14.2134 28.1236 15.6952 4.5285 34.3128 20.0051 3.3800 19.2776 23.6233 43.2907 82.2025 2.6295 161.0000 131.2652 46.5476 15.5639 31.6000 37.3565 1.4694 4.1581 18.1565 15.6965 79.6993 31.6530 76.4724 24.6710 8.4193 6.4401 1.4889 6.9012 76.6506 14.5688 6.9860 30.5749 6.1657 54.3375 35.1274 16.1344 28.5657 9.2873 6.8075 37.9055 12.8263 22.4049 157.8838 33.5439 32.0228 6.2752 132.8999 63.8006 66.0275 24.0352 1.5044 1.7319 0.5562 17.1019 43.9430 52.3627 51.6217 45.0737 10.8845 12.8370 21.1221 17.1692 54.9946 18.4797 15.1684 654.9746 0.9801 40.6871 18.3196 71.9599 43.6980 13.3494 20.8427
temp: 298.150 k
press: 1.00000 atm
elementType: 8 8 8 8 8 8 8 7 7 6 6 6 6 6 6 6 6 6 6 6 6 1 1 1 1 1 1 1 1 1 1 1 1 1 1 1 1 1 1 1 1
symmnumber: 1
zpe: 858843.7 jmol-1
zpe.correction: 0.327116 hartree
zpe.thermalcorrener: 0.349145 hartree
zpe.thermalcorrenthalpy: 0.350090 hartree
zpe.thermalcorrgfe: 0.274280 hartree
zpe.sumelectzpe: -1103.633635 hartree
zpe.sumelectthermal: -1103.611606 hartree
zpe.sumelectthermalent: -1103.610662 hartree
zpe.sumelectthermalfe: -1103.686472 hartree
dipole: 6.4838 -0.5095 2.5423
dipole: 6.9830
quadrupole: -168.8691 -133.5418 -122.6636
quadrupole: -0.4350 19.1456 -4.1117
quadrupole: -27.1776 8.1497 19.0279 -0.4350 19.1456 -4.1117
hfenergy: -1103.9607512 hartree
pointgroup: C01 [X(C12H20N2O7)]
dipole: 2.5462302 0.5684415 0.8610088 debye
polarizability: 240.2879292|-4.0502198|127.3249966|0.601964|-20.127342|148.7925231 unknown
InChI: InChI=1S/C12H20N2O7/c15-4-9(18)8(17)1-6-2-14-7(3-13-6)11(20)12(21)10(19)5-16/h2-3,8-12,15-21H,1,4-5H2
charge 0 multiplicity 1
41 atoms
O  5.01978 0.705126 -0.771765
O  2.882117 0.8284 -2.308498
O  5.230722 0.125508 1.85376
O  -3.579046 1.046112 -1.4198
O  -6.005488 -0.009424 -1.53358
O  4.845371 -2.586202 2.023748
O  -7.109307 0.591274 0.913203
N  1.04162 -0.903118 0.356182
N  -0.970799 0.532394 -1.01784
C  3.755411 0.486147 -0.048628
C  2.799045 -0.053299 -1.147439
C  4.017346 -0.4319 1.168034
C  -3.715994 -0.236819 -0.710604
C  -2.745583 -0.297067 0.495756
C  -5.208496 -0.331759 -0.331527
C  1.346134 -0.110036 -0.71744
C  -1.291583 -0.254217 0.064947
C  4.389995 -1.88364 0.825552
C  -5.651166 0.622309 0.800675
C  0.332384 0.599641 -1.409047
C  -0.265118 -0.970807 0.733374
H  3.368423 1.464388 0.313624
H  3.133971 -1.076094 -1.424154
H  3.153263 -0.42837 1.854908
H  -3.481298 -1.070444 -1.408726
H  -2.931885 -1.207724 1.095695
H  -2.950288 0.574686 1.148671
H  -5.479789 -1.369697 -0.067958
H  3.493518 -2.423934 0.483523
H  5.163691 -1.898694 0.029238
H  -5.267028 0.293615 1.782551
H  -5.283663 1.648325 0.585005
H  0.584706 1.213981 -2.274165
H  -0.496317 -1.617478 1.58641
H  5.727428 0.806842 -0.078927
H  3.848045 1.037249 -2.428545
H  4.958806 0.763874 2.558075
H  -2.584687 1.153111 -1.583844
H  -5.488203 0.707252 -2.001175
H  5.547071 -2.013944 2.432706
H  -7.445807 0.585534 -0.025075
