program: Gaussian 09
title: 000007436
version: EM64L-G09RevD.01
frameworkgroup: C1[X(C9H11NO3)]
method: RPBEPBE
basis: SDD
operation: Freq
keyword: #p
keyword: freq=noraman
keyword: PBEPBE/SDD
title: #p freq=noraman PBEPBE/SDD
converged: YES YES NO NO
title: Mulliken charges:
elementType: O O O N C C C C C C C C C H H H H H H H H H H H
charge: -0.240850 -0.427251 -0.473967 -0.339209 0.351715 -0.425417 0.095124 -0.463757 -0.347018 0.177983 -0.350330 0.152615 -0.623712 0.233599 0.206671 0.301294 0.240944 0.225708 0.308959 0.217858 0.190224 0.225364 0.385417 0.378038
chargesum: 0.00000
title: Mulliken charges with hydrogens summed into heavy atoms:
elementType: O O O N C C C C C C C C C
charge: -0.240850 -0.041835 -0.095929 -0.030250 0.351715 0.014853 0.095124 -0.162464 -0.106074 0.177983 -0.124622 0.152615 0.009733
polarizability: 1.96970937e+02 5.61796328e+00 1.20742209e+02 -6.09551561e-02 3.06338809e-01 5.69087652e+01
1716.lowfreq: -6.9491 -0.0008 -0.0007 -0.0003 8.2171 13.1625 35.3636 76.6134 88.1887
frequency: 35.3374 76.6036 88.1828 113.0023 133.8200 207.2913 214.0232 230.7865 270.1422 287.4290 302.7118 317.1298 362.9867 386.4245 437.0492 478.9686 504.8060 517.7260 562.9223 603.8227 608.4140 629.1795 720.6033 749.8957 765.6012 782.5527 882.5277 906.4382 919.9112 976.0439 979.2297 1032.5135 1076.5119 1115.0515 1144.0927 1151.6525 1172.1423 1185.0087 1195.7325 1228.4340 1258.9024 1272.5212 1305.2633 1324.2594 1410.6495 1437.8075 1444.7913 1457.6386 1465.3711 1480.4770 1494.7206 1503.7648 1572.3206 1604.4400 1626.5389 2812.9621 2858.4362 2947.6751 2993.5272 3073.1533 3124.2764 3164.3431 3175.0608 3485.4126 3528.7267 3617.7418
redmass: 4.8579 2.7844 3.5098 4.3095 2.4085 2.9665 2.2640 2.3691 4.8163 5.3765 1.2910 3.2146 3.6212 6.4431 3.2233 1.1171 3.3702 3.8784 5.4420 1.4783 5.1052 3.3691 4.0096 6.6085 5.0064 1.4094 4.7801 1.3727 1.3927 2.1709 2.2467 2.0753 2.0055 1.2710 1.5195 1.3905 1.6734 1.4658 1.6235 2.9106 2.4275 2.3042 1.5849 1.7944 6.4887 1.1494 1.3482 1.1681 1.6817 1.4149 1.1013 2.7905 7.2030 7.2190 6.8250 1.0719 1.0574 1.0820 1.0767 1.0963 1.0896 1.0942 1.0924 1.0753 1.0650 1.0666
irintensity: 0.8316 0.6351 3.1366 0.2540 1.4338 1.1168 3.7731 5.9893 5.5303 6.9835 132.7787 47.3920 16.1272 13.3373 9.7900 139.8573 8.4953 6.9681 24.1083 100.1805 31.0994 24.6928 0.3740 15.4464 39.5684 44.3759 43.0671 3.5988 16.5280 26.0165 13.4329 3.0453 267.8955 8.7486 18.6815 3.0525 32.6104 28.4014 13.3795 144.1957 204.7567 158.3509 44.8833 139.5814 15.9581 8.8623 56.2246 14.6540 10.7329 5.2174 59.3311 81.4199 139.2222 33.2661 23.5901 72.2668 198.0477 46.4956 73.0849 38.9624 14.6882 6.2259 4.8479 19.0851 87.0057 85.4840
temp: 298.150 k
press: 1.00000 atm
elementType: 8 8 8 7 6 6 6 6 6 6 6 6 6 1 1 1 1 1 1 1 1 1 1 1
symmnumber: 1
zpe: 489233.7 jmol-1
zpe.correction: 0.186339 hartree
zpe.thermalcorrener: 0.199436 hartree
zpe.thermalcorrenthalpy: 0.200380 hartree
zpe.thermalcorrgfe: 0.146566 hartree
zpe.sumelectzpe: -628.986886 hartree
zpe.sumelectthermal: -628.973790 hartree
zpe.sumelectthermalent: -628.972846 hartree
zpe.sumelectthermalfe: -629.026659 hartree
dipole: -2.5705 -5.7022 0.8983
dipole: 6.3190
quadrupole: -62.3731 -74.1013 -80.7395
quadrupole: 6.7483 3.9590 0.4994
quadrupole: 10.0315 -1.6967 -8.3348 6.7483 3.9590 0.4994
hfenergy: -629.1732257 hartree
pointgroup: C01 [X(C9H11N1O3)]
dipole: 1.0487471 2.244401 0.2083802 debye
dipolederiv: -0.7640292 -0.1506078 0.0207736 -0.3537183 -0.8813826 0.0358786 0.0694436 0.045688 -0.313116 -0.967789 0.6099977 -0.0538107 0.7418782 -0.6165757 0.0240845 -0.0682501 0.0251753 -0.417329 -1.6402752 -0.3862503 0.0199695 -0.384533 -0.2199332 -0.0229868 0.0123747 -0.0252093 -0.4262204 -0.9663138 0.0466295 0.0276687 0.0043812 -0.3204194 -0.139874 -0.2163412 -0.1595539 -0.6366671 -0.7820314 -0.2933752 0.0280149 -0.0864739 -0.0338288 -0.0003081 -0.0094918 0.0073131 -0.0317308 0.2668362 0.2980717 0.0597456 0.8789229 -0.084856 0.0350043 0.1203396 0.0021986 0.4197709 1.5767385 0.1893867 -0.0358175 0.0333528 0.953599 -0.0509077 -0.097547 -0.0477143 0.1221928 -0.0033069 0.3236065 -0.0225392 -0.1456316 -0.0105784 -0.008522 0.0226258 -0.0038241 -0.1173977 0.0511315 0.0901946 -0.0058559 0.1184726 -0.0113741 -0.0081538 -0.0025856 -0.0186588 -0.1480849 0.6458757 -0.6967152 0.0629229 -1.1225534 0.420619 -0.0405345 0.0930476 -0.0373352 0.0701692 -0.2941786 -0.076382 0.0100092 0.171704 0.0832639 -0.0206428 -0.0161086 -0.0193185 -0.1633021 1.3207156 0.3534272 -0.0145346 0.6487681 0.0545914 0.0085097 -0.0326951 0.0029157 0.0313284 0.5703656 -0.1728436 -0.1084808 -0.3929215 0.3112424 0.1085784 -0.0982499 0.0888838 0.4308858 -0.0314978 -0.0563115 0.0492657 -0.11573 -0.0317166 0.0900663 0.0843281 0.1064414 -0.0360183 -0.0665848 -0.023822 -0.030849 -0.0610333 -0.027575 -0.1011594 -0.0908411 -0.1281805 -0.1345331 0.1486864 -0.0342073 0.0003994 0.0136911 0.0446184 0.010081 -0.0003771 0.0094608 0.1665967 0.0159697 0.097669 -0.0110798 0.1007018 0.0198528 0.0099906 -0.0109653 0.0135216 0.1476219 0.0251324 -0.080842 0.004839 -0.0850454 -0.0806312 0.0196164 0.003197 0.0192139 0.1707043 0.2411723 0.0617733 0.0191301 -0.057075 0.1454279 0.0546401 0.0741485 0.1272666 0.276551 0.0554472 0.0012879 0.021701 0.1453691 -0.1263332 0.108941 -0.0131624 0.1343341 -0.0265004 -0.0247721 0.011594 -0.0250242 0.1670745 -0.0062216 -0.1187399 0.1820765 -0.135287 -0.2836065 -0.1663345 -0.0724899 -0.017754 -0.1533822 0.0220981 -0.0267974 -0.0118193 -0.0413111 0.097292 0.3568062 -0.1423833 0.0104844 -0.157246 0.2700203 0.0083012 0.0124519 0.0079608 0.3945309 0.4322361 0.1025919 -0.0091783 0.0910273 0.1260927 0.0249345 -0.0055989 0.026019 0.4068624 unknown
polarizability: 197.1374638|4.3333511|120.2691772|-0.2515865|-4.417721|57.2152703 unknown
InChI: InChI=1S/C9H11NO3/c1-10-5-9(13)6-2-3-7(11)8(12)4-6/h2-4,10-12H,5H2,1H3
charge 0 multiplicity 1
24 atoms
O  -1.831561 -1.687787 0.128215
O  3.258045 -1.657124 0.180188
O  4.0287 0.920233 -0.015651
N  -3.927177 -0.029228 -0.234835
C  -0.088127 -0.026225 -0.002382
C  -2.627805 0.594634 -0.05639
C  -1.517368 -0.463585 0.01875
C  0.91673 -1.028511 0.094842
C  0.291031 1.339987 -0.106717
C  2.272103 -0.673912 0.086829
C  1.654212 1.702531 -0.11246
C  2.637552 0.698852 -0.017627
C  -5.098342 0.750074 0.164889
H  -2.403919 1.30429 -0.882038
H  -2.554041 1.195246 0.890982
H  0.622207 -2.078717 0.175876
H  -0.465377 2.126303 -0.183233
H  1.946856 2.756776 -0.192676
H  -3.918809 -1.021005 0.029314
H  -5.190736 1.660711 -0.459149
H  -5.086189 1.081413 1.234133
H  -6.012232 0.151449 0.005268
H  4.152854 -1.22624 0.156849
H  4.258293 1.876936 -0.094776
