program: Gaussian 09
title: 000062787
version: EM64L-G09RevD.01
frameworkgroup: C1[X(C11H17NO2)]
method: RPBEPBE
basis: SDD
operation: Freq
keyword: #p
keyword: freq=noraman
keyword: PBEPBE/SDD
title: #p freq=noraman PBEPBE/SDD
converged: YES YES NO NO
title: Mulliken charges:
elementType: O O N C C C C C C C C C C C H H H H H H H H H H H H H H H H H
charge: -0.273947 -0.272212 -0.596908 -0.557980 -0.059791 0.393460 0.145384 -0.692632 -0.527553 0.321183 -0.333888 -0.379186 -0.539505 -0.536758 0.188988 0.262643 0.196461 0.226891 0.231793 0.194190 0.243914 0.258919 0.267101 0.237446 0.246817 0.216834 0.218769 0.242354 0.217510 0.242520 0.217182
chargesum: 0.00000
title: Mulliken charges with hydrogens summed into heavy atoms:
elementType: O O N C C C C C C C C C C C
charge: -0.273947 -0.272212 -0.070888 -0.106350 0.136670 0.393460 0.145384 -0.039758 -0.283638 0.321183 -0.096442 -0.132369 0.138453 0.140454
polarizability: 1.66789721e+02 8.09748174e+00 1.52278556e+02 -6.66818828e+00 8.40555620e+00 8.95161643e+01
1716.lowfreq: -4.8060 0.0003 0.0003 0.0004 7.7882 12.0953 34.9963 51.9696 63.4380
frequency: 34.8523 51.8410 63.4364 80.2765 105.9263 146.5663 179.6628 205.6842 218.2042 225.1831 252.1728 257.0922 267.1928 312.2637 325.0849 373.0940 389.6482 428.6137 439.2353 450.9997 469.8035 545.4409 566.4429 590.1821 622.9569 674.4939 720.6013 757.3629 803.3171 830.2585 867.7491 889.7145 918.9671 925.2676 960.6632 990.2736 997.7946 1008.3803 1056.7467 1112.8596 1113.2898 1113.6982 1133.5168 1148.1373 1158.1833 1178.3985 1196.1470 1219.2942 1224.9176 1252.1543 1281.8070 1293.3409 1340.2033 1367.7673 1382.5350 1384.1969 1414.0837 1438.3861 1442.0651 1460.8536 1465.5642 1467.1424 1468.3894 1471.8240 1475.3095 1475.7600 1497.3217 1595.8602 1617.3741 1630.4634 2846.5523 2951.5505 2952.8795 2970.3395 2978.3548 3036.1464 3037.8694 3070.9596 3084.5536 3101.1840 3118.3033 3118.6265 3140.7688 3151.2586 3172.7008 3449.4003 3580.2072
redmass: 2.8310 3.4245 2.9575 3.8972 3.5106 3.8490 2.9249 2.1765 1.1274 1.5761 1.2446 1.3427 1.5942 2.9133 3.0817 3.8297 2.7510 4.1793 2.5664 3.1037 3.0885 2.6187 1.6991 3.0661 4.6914 5.3897 3.8862 4.3991 1.4810 2.2911 1.7495 1.4385 3.6618 1.3967 1.9451 7.3832 1.8033 3.2353 1.7709 1.2715 1.9108 1.2789 1.8045 1.5186 1.3864 1.4600 2.4702 1.4307 1.6279 2.6999 1.3445 1.5932 1.4007 1.5332 2.0774 2.3007 2.5876 1.1997 1.3506 1.0959 1.0509 1.0564 1.0757 1.1392 1.0527 1.0559 2.1164 7.9061 6.4771 1.1026 1.0817 1.0331 1.0332 1.0667 1.0386 1.1036 1.1036 1.0966 1.0931 1.1000 1.0989 1.0987 1.0901 1.0870 1.0964 1.0445 1.0978
irintensity: 0.6704 0.3194 7.7348 0.6666 0.3369 8.8604 3.6924 0.5847 8.1903 19.8236 2.0286 21.2167 0.3338 3.8421 6.9384 0.0649 1.0580 0.9643 10.2774 17.8923 5.0601 72.3299 128.2298 19.3807 5.1088 33.7782 3.1151 1.4758 44.6709 11.8097 18.8039 0.0839 3.6333 0.2931 3.7135 17.0311 15.2133 79.6505 11.9497 0.4023 10.0800 0.7726 28.5763 1.6271 3.1168 38.0423 268.2025 3.1698 45.9747 1.9422 6.0859 6.5097 39.0647 2.8881 10.1052 47.6075 37.5444 4.6410 3.0400 3.7748 15.1078 19.4904 22.1631 155.2426 5.2640 3.7427 109.8993 5.2000 16.0564 48.4943 94.5573 115.4863 31.4927 53.0693 26.7826 51.2700 55.6946 40.0590 7.2655 28.8356 31.9140 21.9345 12.7421 8.2637 9.6328 1.8998 0.0413
temp: 298.150 k
press: 1.00000 atm
elementType: 8 8 7 6 6 6 6 6 6 6 6 6 6 6 1 1 1 1 1 1 1 1 1 1 1 1 1 1 1 1 1
symmnumber: 1
zpe: 685376.2 jmol-1
zpe.correction: 0.261046 hartree
zpe.thermalcorrener: 0.276565 hartree
zpe.thermalcorrenthalpy: 0.277509 hartree
zpe.thermalcorrgfe: 0.218191 hartree
zpe.sumelectzpe: -633.444529 hartree
zpe.sumelectthermal: -633.429011 hartree
zpe.sumelectthermalent: -633.428066 hartree
zpe.sumelectthermalfe: -633.487384 hartree
dipole: -0.2108 -0.9428 0.3429
dipole: 1.0251
quadrupole: -89.3346 -62.4337 -87.1603
quadrupole: 6.1507 3.4983 2.1897
quadrupole: -9.6917 17.2091 -7.5174 6.1507 3.4983 2.1897
hfenergy: -633.7055753 hartree
pointgroup: C01 [X(C11H17N1O2)]
dipole: 0.0270896 0.38828 0.1056295 debye
polarizability: 164.3091721|10.1061518|153.7211262|4.7339958|-12.3542806|90.5541435 unknown
InChI: InChI=1S/C11H17NO2/c1-8(12)6-9-7-10(13-2)4-5-11(9)14-3/h4-5,7-8H,6,12H2,1-3H3
charge 0 multiplicity 1
31 atoms
O  -1.285632 -2.06539 -0.143305
O  3.360955 1.135907 0.063787
N  -3.447631 2.170336 -0.354267
C  -1.576307 0.659693 -0.874526
C  -2.242359 1.540532 0.22664
C  -0.237843 0.075854 -0.454727
C  -0.106094 -1.290461 -0.08043
C  -2.652814 0.71602 1.46172
C  0.914467 0.899186 -0.411269
C  2.169056 0.385405 -0.004022
C  1.150523 -1.808722 0.324296
C  2.283693 -0.97343 0.364659
C  -1.180681 -3.480747 0.20533
C  3.286553 2.546045 -0.313387
H  -1.42981 1.294297 -1.773441
H  -2.286781 -0.138981 -1.142991
H  -1.479625 2.291714 0.55566
H  -1.775668 0.216412 1.907285
H  -3.387713 -0.054145 1.169632
H  -3.108583 1.36442 2.235355
H  0.809457 1.946939 -0.71334
H  -3.271414 2.740213 -1.188074
H  -4.044044 2.649807 0.327209
H  1.259947 -2.859162 0.609393
H  3.260264 -1.357988 0.673522
H  -0.854732 -3.61792 1.255488
H  -0.482486 -4.014652 -0.469562
H  -2.196661 -3.884147 0.07945
H  2.972584 2.667899 -1.369264
H  4.308203 2.934142 -0.185847
H  2.591877 3.106124 0.343924
