program: Gaussian 09
title: 000062779
version: EM64L-G09RevD.01
frameworkgroup: C1[X(C18H17ClN2O2)]
method: RPBEPBE
basis: SDD
operation: Freq
keyword: #p
keyword: freq=noraman
keyword: PBEPBE/SDD
title: #p freq=noraman PBEPBE/SDD
converged: YES YES NO NO
title: Mulliken charges:
elementType: Cl O O N N C C C C C C C C C C C C C C C C C C H H H H H H H H H H H H H H H H H
charge: -0.056951 -0.296720 -0.229534 -0.183638 -0.419810 0.027572 -0.392547 -0.003988 0.326858 -0.495027 0.473180 0.283302 -0.713767 0.087879 -0.356733 -0.377761 -0.398411 -0.390748 -0.128404 -0.223477 -0.229214 -0.232999 -0.245673 0.197403 0.233977 0.226863 0.256639 0.230330 0.223488 0.241286 0.212892 0.316955 0.324008 0.247875 0.278385 0.247003 0.259381 0.224388 0.228144 0.227595
chargesum: 0.00000
title: Mulliken charges with hydrogens summed into heavy atoms:
elementType: Cl O O N N C C C C C C C C C C C C C C C C C C
charge: -0.056951 -0.296720 -0.229534 -0.183638 -0.095802 0.027572 0.038833 0.222875 0.326858 -0.008058 0.473180 0.283302 -0.036100 0.087879 -0.039777 -0.129887 -0.120026 -0.143745 -0.128404 0.035904 -0.004827 -0.004855 -0.018078
polarizability: 2.66324772e+02 -1.34086835e+01 1.98574503e+02 -2.10672448e+01 -1.97867581e+00 1.89089316e+02
1716.lowfreq: -4.4644 -0.0018 -0.0018 -0.0013 7.0902 8.9817 26.1775 43.5069 46.3807
frequency: 25.9178 43.4993 46.3793 65.1014 72.9623 112.0753 124.2889 144.9907 163.3855 178.4739 203.2462 217.6659 230.1718 270.9997 288.2835 301.6915 316.2882 326.1444 345.7726 361.7912 404.6209 409.6946 420.0659 460.0303 469.0911 497.8099 516.2371 533.8407 546.0630 567.5669 609.9597 616.5648 639.3266 649.5248 674.0735 700.1310 707.3290 729.5755 740.7396 774.0477 814.8432 832.5706 853.4035 859.6153 886.8478 907.0228 916.8377 929.1976 930.7894 940.3293 947.9243 950.8552 977.9701 985.4044 987.4903 990.8092 1003.0747 1026.2502 1063.1318 1079.0300 1083.2384 1099.8413 1117.1614 1132.0040 1148.3584 1169.0754 1169.8636 1177.9534 1192.0788 1195.4517 1205.1628 1229.1761 1241.8664 1249.1092 1295.1414 1305.4508 1309.1820 1331.4276 1354.4341 1358.7184 1380.4008 1382.1220 1388.1170 1393.1677 1431.7364 1434.4219 1463.0420 1464.3949 1470.6287 1474.9384 1477.0273 1482.0209 1579.3298 1591.3112 1599.7641 1608.2715 1637.6266 2862.5155 2899.6762 2980.1223 2991.8155 3033.7361 3076.7365 3089.4404 3099.8921 3121.9120 3131.2197 3138.2933 3143.4941 3154.7267 3165.2865 3174.5046 3181.8907 3509.3955
redmass: 4.9844 4.0938 6.4998 4.8296 6.7461 4.6381 3.0179 4.4573 5.9865 4.6116 1.3059 2.6541 4.6291 5.7919 4.9677 4.8136 5.3989 5.8117 5.1121 3.9659 2.9232 4.0113 4.3361 2.8776 3.8815 3.4169 4.1857 3.7881 3.4520 4.5971 2.7305 5.1594 5.2638 3.1042 4.4035 4.4789 1.8222 4.4868 4.8694 1.9802 1.7420 2.8851 4.3220 1.2511 2.8193 2.4459 2.6557 1.9019 3.3988 1.6438 1.6228 1.5511 3.0494 1.4626 1.9043 5.4287 1.3519 2.1220 2.4350 2.0524 1.6297 2.8054 1.9353 1.6075 1.8238 1.3369 1.5942 1.3954 2.1450 2.4867 1.8240 2.3791 1.7400 1.4389 1.3600 1.1943 1.3419 2.3854 3.2471 1.7171 1.8053 8.5503 3.9830 1.2936 2.2800 2.3523 1.0618 1.1120 2.7043 2.2091 1.0514 1.0897 8.1572 6.3438 7.1480 6.1513 5.8837 1.0702 1.0692 1.0843 1.0361 1.0933 1.0889 1.0992 1.1003 1.0845 1.0880 1.0899 1.0931 1.0953 1.0999 1.0960 1.0919 1.0757
irintensity: 0.9724 0.3432 0.7418 1.4654 0.8369 0.6670 0.7226 2.8105 1.1234 0.7559 0.2554 0.3228 0.6211 1.3620 5.0071 2.1637 0.3848 2.6694 3.1179 0.7650 0.5444 1.1434 6.3950 6.4220 7.8451 16.4790 18.5482 7.2846 15.9946 14.2866 23.7083 5.2798 33.7092 28.1905 20.8598 19.5079 59.1680 6.4115 9.3452 49.2521 58.6368 9.1782 28.6466 0.0962 0.2160 30.7258 2.7508 7.8297 51.5886 1.3155 7.8144 6.6734 18.1559 2.9567 13.9067 0.4664 0.7787 10.8643 67.8429 16.5712 13.0885 38.8851 22.2345 3.4135 4.1051 31.8540 47.9146 43.2946 40.8747 28.7399 25.1850 15.2519 15.3275 9.8874 5.6962 8.0039 4.0873 112.7742 2.4897 10.7833 18.7740 1.1579 26.3760 27.3270 0.3667 31.4384 7.9841 10.2106 154.8456 9.2444 11.8757 12.9807 3.3094 0.4187 1.7061 0.6229 398.2087 73.9448 95.4935 32.2521 22.5048 36.2057 10.3777 26.5236 24.9339 0.3879 6.0185 6.3206 23.7826 18.6948 24.0556 2.4997 7.3680 26.5590
temp: 298.150 k
press: 1.00000 atm
elementType: 17 8 8 7 7 6 6 6 6 6 6 6 6 6 6 6 6 6 6 6 6 6 6 1 1 1 1 1 1 1 1 1 1 1 1 1 1 1 1 1
symmnumber: 1
zpe: 818045.3 jmol-1
zpe.correction: 0.311577 hartree
zpe.thermalcorrener: 0.331250 hartree
zpe.thermalcorrenthalpy: 0.332194 hartree
zpe.thermalcorrgfe: 0.262974 hartree
zpe.sumelectzpe: -1414.481639 hartree
zpe.sumelectthermal: -1414.461966 hartree
zpe.sumelectthermalent: -1414.461022 hartree
zpe.sumelectthermalfe: -1414.530242 hartree
dipole: -0.5053 1.0460 -0.2382
dipole: 1.1858
quadrupole: -149.1984 -128.0293 -141.6973
quadrupole: 13.3419 9.4602 -10.3327
quadrupole: -9.5567 11.6124 -2.0556 13.3419 9.4602 -10.3327
hfenergy: -1414.7932162 hartree
pointgroup: C01 [X(C18H17Cl1N2O2)]
dipole: 0.2214664 -0.4101516 -0.0196894 debye
polarizability: 256.6738352|-9.291433|198.0625639|34.5400063|0.3178174|199.2521915 unknown
InChI: InChI=1S/C18H17ClN2O2/c1-12-10-21-11-17(22)20-16-8-7-14(19)9-15(16)18(21,23-12)13-5-3-2-4-6-13/h2-9,12,20H,10-11H2,1H3
charge 0 multiplicity 1
40 atoms
Cl 4.774499 -0.161646 1.890987
O  0.091243 -1.975202 0.655196
O  -1.4262 1.738275 -3.132443
N  -0.619601 -1.092528 -1.414189
N  0.17264 1.898813 -1.460108
C  -0.177689 -0.685788 -0.037246
C  -0.478763 -2.562019 -1.550059
C  -0.644896 -3.032364 -0.094602
C  1.134524 0.126466 -0.004855
C  -0.151329 -0.295004 -2.561118
C  -1.297227 0.053992 0.73238
C  1.230307 1.396606 -0.643407
C  -0.03058 -4.382041 0.259278
C  -0.544116 1.18147 -2.41989
C  2.233972 -0.34443 0.74884
C  -1.036217 0.523569 2.045669
C  -2.587047 0.224371 0.180255
C  2.389488 2.193374 -0.469459
C  3.376371 0.460013 0.896422
C  3.468758 1.738823 0.314457
C  -2.054051 1.149208 2.795214
C  -3.606601 0.854803 0.929946
C  -3.345038 1.318473 2.238446
H  0.523173 -2.863967 -1.938062
H  -1.259659 -2.965994 -2.219788
H  -1.715348 -2.989629 0.19408
H  -0.656292 -0.663803 -3.468399
H  0.953604 -0.372072 -2.719556
H  1.039733 -4.407107 -0.010664
H  -0.122503 -4.57247 1.342111
H  -0.551951 -5.194549 -0.278732
H  2.158118 -1.323068 1.227694
H  -0.041651 2.900311 -1.421633
H  -0.040282 0.3885 2.482419
H  -2.774184 -0.13565 -0.836138
H  2.454224 3.166483 -0.969198
H  4.362232 2.354446 0.450401
H  -1.844744 1.503345 3.811079
H  -4.60085 0.988134 0.488794
H  -4.135168 1.808058 2.819176
