program: Gaussian 09
title: 000062764
version: EM64L-G09RevD.01
frameworkgroup: C1[X(C14H21NS)]
method: RPBEPBE
basis: SDD
operation: Freq
keyword: #p
keyword: freq=noraman
keyword: PBEPBE/SDD
title: #p freq=noraman PBEPBE/SDD
converged: YES YES NO NO
title: Mulliken charges:
elementType: S N C C C C C C C C C C C C C C H H H H H H H H H H H H H H H H H H H H H
charge: 0.206002 -0.192892 0.452764 -0.506617 -0.501929 -0.376540 -0.368830 -0.398791 -0.396867 -0.395605 -0.454490 -0.457289 -0.143737 -0.293969 -0.161868 -0.518079 0.211624 0.221773 0.217602 0.197929 0.211537 0.215707 0.209147 0.215566 0.218385 0.187864 0.185763 0.219689 0.188796 0.197667 0.208218 0.224790 0.223917 0.208441 0.245281 0.239704 0.259336
chargesum: 0.00000
title: Mulliken charges with hydrogens summed into heavy atoms:
elementType: S N C C C C C C C C C C C C C C
charge: 0.206002 -0.192892 0.452764 -0.073220 -0.086398 0.050703 0.055883 0.007458 0.008584 -0.009142 -0.021482 -0.024931 -0.143737 -0.048687 0.077836 -0.258743
polarizability: 1.95795607e+02 8.13547901e-02 1.42066947e+02 -2.28380060e+00 -6.32987733e-01 1.56898585e+02
1716.lowfreq: -85.8732 -13.5725 -0.0015 -0.0002 0.0015 4.8189 8.3914 37.1195 67.2069
frequency: -85.7829 37.0974 67.1465 81.1167 87.8837 137.1240 153.2778 160.3716 237.5304 260.8886 280.1541 284.1754 302.2601 360.9190 382.0460 414.5776 467.3965 496.3925 502.6645 543.8699 600.0501 604.5989 636.3344 671.0491 689.0645 699.3265 749.3160 779.2404 797.9331 825.9257 828.3963 836.6307 854.2566 868.4590 890.6297 904.4542 905.6194 912.2523 929.5927 971.7758 976.2789 979.5428 1024.8963 1042.6593 1062.8986 1070.9774 1078.9877 1090.7964 1094.1329 1096.3194 1120.2382 1130.8908 1149.5740 1157.9537 1194.6363 1195.3117 1204.0610 1221.6615 1228.0858 1244.3205 1262.7434 1272.8905 1274.4004 1286.8076 1292.1277 1317.0230 1322.1384 1334.0987 1340.7895 1343.6163 1346.7157 1347.2686 1359.5972 1449.5272 1459.4794 1460.6887 1464.4932 1466.0856 1472.0539 1479.3149 1482.2881 1486.0500 1499.0624 1532.7840 2882.9192 2892.8287 2960.5959 2979.3961 2981.2388 2987.4051 2992.0059 3006.8550 3019.6037 3026.2471 3028.8080 3035.7935 3038.3790 3043.1307 3047.3070 3054.7423 3062.4423 3087.8180 3162.4787 3180.4250 3234.1599
redmass: 1.5991 5.3952 3.6710 2.8476 3.3734 3.6699 2.8373 2.6043 2.9496 5.4204 2.5475 2.4647 3.8073 3.4530 1.9088 3.0402 4.1358 3.2393 1.7250 3.0287 4.7645 5.3081 3.0661 3.9335 1.2274 2.7146 1.8106 1.5216 3.2713 1.9693 1.7821 2.4625 1.4446 1.9254 2.2330 1.6562 2.1703 2.1464 1.5509 1.6003 2.3061 2.1828 2.8879 2.0582 1.8609 1.4680 1.2759 1.6603 2.0326 1.6198 3.3083 2.4629 2.3663 1.7610 1.3385 1.3480 1.5826 1.4097 1.4103 1.3083 1.3560 1.3214 1.2848 1.2165 1.3263 1.3733 1.6774 1.7589 1.4474 1.4380 1.3957 1.4478 1.4331 1.0868 1.0835 1.0884 1.0820 1.0904 7.4534 1.0877 1.0902 1.0811 1.0981 5.2681 1.0699 1.0703 1.0627 1.0594 1.0609 1.0620 1.0632 1.0597 1.0666 1.0960 1.0961 1.0926 1.0963 1.0919 1.1009 1.1019 1.1046 1.1055 1.0893 1.0969 1.1002
irintensity: 0.0359 0.2028 0.3036 0.3412 0.6226 0.1659 0.0149 0.2310 4.7342 0.4076 0.5115 0.3925 1.3468 23.8120 1.4737 0.2653 2.3818 0.0078 9.2234 2.2867 4.4791 2.3069 0.5591 2.4649 97.2230 10.5978 9.0503 1.3442 13.2733 6.9092 11.5711 13.3363 1.4285 1.7908 1.3547 0.9870 3.7681 7.5930 1.4204 8.2501 11.8658 0.7809 32.5391 8.2376 9.4086 1.6922 1.7070 1.5186 8.7928 2.0797 8.8836 4.3581 19.9475 6.1538 4.5147 2.3379 6.4944 1.4338 28.1320 6.5443 8.8959 6.9142 3.6039 0.8896 3.3582 0.0542 0.9591 2.7737 0.4504 2.4175 0.2404 2.0230 1.5164 6.2818 12.9052 7.6160 2.4648 10.4376 15.5617 11.1324 12.3664 0.1618 1.7314 1.5095 39.8076 62.3542 39.5382 20.3551 49.2743 54.9059 16.7992 23.2489 78.7034 67.1213 0.0708 61.6831 58.2646 10.0695 8.3704 114.6468 1.7861 68.4912 9.6280 6.4865 1.3896
temp: 298.150 k
press: 1.00000 atm
elementType: 16 7 6 6 6 6 6 6 6 6 6 6 6 6 6 6 1 1 1 1 1 1 1 1 1 1 1 1 1 1 1 1 1 1 1 1 1
symmnumber: 1
zpe: 841170.0 jmol-1
zpe.correction: 0.320385 hartree
zpe.thermalcorrener: 0.334873 hartree
zpe.thermalcorrenthalpy: 0.335817 hartree
zpe.thermalcorrgfe: 0.278784 hartree
zpe.sumelectzpe: -997.636092 hartree
zpe.sumelectthermal: -997.621604 hartree
zpe.sumelectthermalent: -997.620659 hartree
zpe.sumelectthermalfe: -997.677693 hartree
dipole: 0.1977 0.5869 0.7203
dipole: 0.9499
quadrupole: -102.2665 -105.1818 -101.8778
quadrupole: -1.0994 -1.3909 -0.3807
quadrupole: 0.8422 -2.0731 1.2309 -1.0994 -1.3909 -0.3807
hfenergy: -997.9564766 hartree
pointgroup: C01 [X(C14H21N1S1)]
dipole: -0.0032987 0.2278466 -0.2962179 debye
polarizability: 192.9073699|-12.3691311|145.1411021|0.8517635|0.9629356|156.7126664 unknown
InChI: InChI=1S/C14H21NS/c1-2-8-14(9-3-1,13-7-6-12-16-13)15-10-4-5-11-15/h6-7,12H,1-5,8-11H2
charge 0 multiplicity 1
37 atoms
S  2.17375 -0.923367 1.499157
N  -0.557706 0.966884 -0.019159
C  -0.309452 -0.518538 -0.004669
C  -0.979873 -1.138587 1.261036
C  -1.001875 -1.15691 -1.253449
C  -0.163662 1.764278 1.174205
C  -0.072185 1.737744 -1.194706
C  -2.50836 -0.918082 1.291698
C  -2.530824 -0.93475 -1.253639
C  -3.181723 -1.503413 0.02842
C  -0.441818 3.228585 0.743948
C  -0.371328 3.21298 -0.819723
C  1.188765 -0.841825 -0.038377
C  2.033017 -1.004743 -1.1321
C  3.425217 -1.197088 -0.803773
C  3.678913 -1.178798 0.556817
H  -0.51616 -0.734442 2.181201
H  -0.761102 -2.22466 1.25257
H  -0.780106 -2.242168 -1.236554
H  -0.56439 -0.759871 -2.187922
H  0.914671 1.636658 1.432196
H  -0.758125 1.47196 2.057322
H  -0.60126 1.429432 -2.113556
H  1.021665 1.594165 -1.365854
H  -2.721489 0.166536 1.345199
H  -2.930159 -1.385451 2.203101
H  -2.971336 -1.410873 -2.15181
H  -2.739353 0.150362 -1.31495
H  -3.074827 -2.608714 0.035109
H  -4.26709 -1.284563 0.036452
H  0.293611 3.919908 1.191273
H  -1.444833 3.54511 1.078356
H  -1.336216 3.533134 -1.249124
H  0.409446 3.888079 -1.211672
H  1.666481 -1.006252 -2.161625
H  4.205979 -1.346898 -1.553874
H  4.622237 -1.301422 1.086177
