program: Gaussian 09
title: 000062744
version: EM64L-G09RevD.01
frameworkgroup: C1[X(C8H10Br2O4)]
method: RPBEPBE
basis: SDD
operation: Freq
keyword: #p
keyword: freq=noraman
keyword: PBEPBE/SDD
title: #p freq=noraman PBEPBE/SDD
converged: YES YES NO NO
title: Mulliken charges:
elementType: Br Br O O O O C C C C C C C C H H H H H H H H H H
charge: 0.029112 0.029121 -0.233600 -0.233466 -0.225872 -0.225989 -0.383109 -0.383084 -0.132341 -0.132371 0.363898 0.363867 -0.766420 -0.766385 0.233393 0.245080 0.233390 0.245062 0.261555 0.261576 0.304402 0.303912 0.304351 0.303918
chargesum: 0.00000
title: Mulliken charges with hydrogens summed into heavy atoms:
elementType: Br Br O O O O C C C C C C C C
charge: 0.029112 0.029121 -0.233600 -0.233466 -0.225872 -0.225989 0.095365 0.095368 0.129214 0.129205 0.363898 0.363867 -0.158106 -0.158117
polarizability: 1.49523876e+02 7.53528310e-02 1.29094068e+02 3.62891669e+00 -1.89848778e-02 1.07550811e+02
1716.lowfreq: -9.0781 -4.3837 -1.4905 0.0004 0.0005 0.0005 2.8425 15.9618 17.9875
frequency: 2.1386 15.7401 17.4150 32.8109 35.3394 54.7213 55.1536 111.8615 120.6223 160.5402 195.4163 208.1876 266.4501 286.1841 293.3310 341.0226 442.5760 447.5312 490.8586 520.9445 539.8880 632.2153 647.4105 723.8117 724.0613 756.7874 776.7902 844.3432 893.2130 895.4875 916.8511 932.4049 943.9023 989.7862 996.9798 1077.9619 1080.5194 1094.7271 1143.4386 1210.3561 1215.1582 1223.9815 1233.7981 1235.4109 1245.6945 1295.9479 1295.9584 1347.0480 1363.3313 1425.6880 1425.6958 1447.3211 1447.6313 1635.0639 1636.2977 1689.4040 3021.3457 3021.7132 3084.6755 3084.6855 3109.9428 3110.7581 3123.7554 3130.3730 3181.3518 3181.3664
redmass: 25.0749 9.9367 6.2908 9.1113 5.5228 6.2668 7.7080 2.6372 8.2752 5.4470 12.0308 6.4512 2.9030 2.5374 3.6887 3.2346 3.8183 3.1520 3.5826 6.1939 4.1508 4.2173 5.6246 6.8822 6.9383 4.1418 4.1114 1.8812 1.8132 1.7273 2.6243 6.0951 3.6502 1.7097 1.1690 1.4768 1.4424 4.1210 2.7296 1.5989 1.5352 1.2287 1.4295 1.6043 1.1255 1.1893 1.2703 1.2485 1.3297 1.1170 1.1168 1.1094 1.1090 9.9433 9.9046 6.2954 1.0614 1.0618 1.0555 1.0555 1.0977 1.0967 1.1033 1.0934 1.1127 1.1127
irintensity: 0.3738 0.5707 1.9039 2.0416 0.9836 1.2217 0.0066 5.1172 0.0085 1.3219 0.2588 10.0323 0.0105 21.8070 0.4116 9.0934 10.2862 4.1853 0.8252 44.1946 16.5165 5.3867 14.8013 0.2333 0.7934 7.4467 4.6457 18.8705 0.4471 1.3810 33.3982 164.6315 44.3001 1.1129 56.0422 273.5187 13.3720 31.2203 3.4672 196.0719 52.6613 110.1770 112.1010 28.1851 0.3872 0.8773 4.9477 12.6864 6.6265 25.2488 14.7162 9.9373 34.5919 258.4470 126.4330 0.0017 17.3575 27.3831 10.8069 2.0780 0.0106 2.5581 0.0013 20.8847 0.5176 0.1927
temp: 298.150 k
press: 1.00000 atm
elementType: 35 35 8 8 8 8 6 6 6 6 6 6 6 6 1 1 1 1 1 1 1 1 1 1
symmnumber: 1
zpe: 449396.2 jmol-1
zpe.correction: 0.171166 hartree
zpe.thermalcorrener: 0.187485 hartree
zpe.thermalcorrenthalpy: 0.188429 hartree
zpe.thermalcorrgfe: 0.117285 hartree
zpe.sumelectzpe: -637.556740 hartree
zpe.sumelectthermal: -637.540421 hartree
zpe.sumelectthermalent: -637.539477 hartree
zpe.sumelectthermalfe: -637.610621 hartree
dipole: 0.0058 1.1452 -0.0028
dipole: 1.1452
quadrupole: -101.9028 -102.4213 -94.5797
quadrupole: -0.0009 17.8094 0.0017
quadrupole: -2.2682 -2.7867 5.0549 -0.0009 17.8094 0.0017
hfenergy: -637.727906 hartree
pointgroup: C01 [X(C8H10Br2O4)]
dipole: 0.0020299 -0.4505503 0.0024456 debye
dipolederiv: -0.1223721 -0.034838 0.0450307 0.0550044 -0.2918936 0.0930629 -0.0003244 0.1336043 -0.1714539 -0.1225981 0.0357679 0.0449969 -0.0545738 -0.2932007 -0.0926018 0.0003714 -0.132742 -0.1698249 -1.2759397 0.3214393 -0.4475341 0.4434148 -0.5724683 0.0936963 -0.4550366 0.1419966 -0.6630407 -1.2751928 -0.3236482 -0.4466521 -0.4450493 -0.5733689 -0.0939924 -0.4539509 -0.143041 -0.6628918 -0.6333625 0.1180596 -0.1811929 -0.2097287 -0.7037072 -0.2320984 -0.3970248 -0.1278333 -0.5493696 -0.6329358 -0.1191317 -0.1809477 0.2084282 -0.702352 0.2329079 -0.3978277 0.1281868 -0.5510442 0.6955702 -0.1515941 0.0542585 -0.4377522 0.5007575 -0.1147505 -0.1474472 -0.0826837 0.2789285 0.695748 0.1520676 0.0538098 0.4371141 0.5016151 0.1141396 -0.1488272 0.082105 0.2782572 -0.0532213 0.0108845 0.0258717 -0.0072446 -0.2786184 0.0545453 0.0613434 0.0636483 0.0532331 -0.0534878 -0.0107862 0.0260591 0.0075377 -0.2790399 -0.0535446 0.061569 -0.0626203 0.0536329 1.2232341 -0.4466018 0.73355 -0.0254069 1.0190772 0.1525522 1.0352878 0.0654305 0.8156621 1.2212383 0.4500221 0.7320132 0.0289317 1.0183355 -0.1536901 1.0355063 -0.0650595 0.8181147 0.079204 0.2142014 -0.161215 0.16051 0.0737319 -0.1489726 -0.1501749 -0.1747584 0.2548962 0.0804682 -0.2155408 -0.1605743 -0.1618662 0.0753752 0.1492635 -0.1501726 0.1746634 0.2520361 0.023676 0.0569478 -0.0959582 0.0466437 0.0733862 -0.0147695 -0.0250839 0.019322 -0.0597013 -0.0816528 -0.0876465 0.0256005 0.0524062 -0.033203 0.0294756 0.0473654 -0.0549559 0.0978032 0.0237236 -0.0572259 -0.0957627 -0.0466477 0.0733575 0.0143902 -0.0249611 -0.0197144 -0.0597263 -0.0817846 0.0876515 0.025413 -0.0522496 -0.0332129 -0.0292538 0.0474569 0.0553608 0.0977513 0.0744148 -0.0167664 -0.0136751 -0.0513501 0.1627617 0.0057574 0.0014845 0.0110965 -0.065399 0.0744722 0.0167432 -0.0137365 0.0513711 0.1627204 -0.0063935 0.0013639 -0.0118749 -0.0653226 0.1115269 -0.0229976 0.0143388 -0.0208115 0.0311459 0.0408499 0.0356264 -0.01624 -0.0574854 -0.040982 -0.0167679 0.0009873 -0.0590598 0.0191147 0.0479892 -0.0059912 0.0532694 0.065843 0.111288 0.022859 0.0148736 0.0211103 0.0311531 -0.0411778 0.0362027 0.0158615 -0.0571772 -0.0410349 0.0169011 0.0004455 0.0592683 0.0185328 -0.047385 -0.0067552 -0.0530218 0.0662785 unknown
polarizability: 149.48634|-0.0628748|129.0938328|3.8398093|-0.0782377|107.5885819 unknown
InChI: InChI=1S/C8H10Br2O4/c9-5-7(11)13-3-1-2-4-14-8(12)6-10/h1-2H,3-6H2
charge 0 multiplicity 1
24 atoms
Br -3.483051 2.655542 -1.267925
Br 3.476901 2.663097 1.253759
O  -2.550374 0.001232 0.921698
O  2.550938 -0.001118 -0.922068
O  -3.849099 -0.915853 -0.793005
O  3.848579 -0.912383 0.796523
C  -1.717749 -1.255576 0.946636
C  1.718413 -1.258063 -0.943385
C  -0.665617 -1.220849 -0.128915
C  0.666282 -1.220466 0.132068
C  -3.575668 0.03025 -0.02035
C  3.575516 0.03115 0.02056
C  -4.30945 1.354592 0.045949
C  4.309368 1.355267 -0.049379
H  -1.283275 -1.259308 1.957492
H  -2.404209 -2.111489 0.810422
H  1.283932 -1.264689 -1.954224
H  2.404958 -2.113522 -0.804785
H  -1.033136 -1.221712 -1.164231
H  1.033784 -1.218526 1.167389
H  -4.219211 1.828896 1.031538
H  -5.351944 1.234829 -0.276076
H  4.223629 1.824349 -1.037878
H  5.350382 1.237249 0.277989
