program: Gaussian 09
title: 000073377
version: EM64L-G09RevD.01
frameworkgroup: C1[X(C6H12N2S2)]
method: RPBEPBE
basis: SDD
operation: Freq
keyword: #p
keyword: freq=noraman
keyword: PBEPBE/SDD
title: #p freq=noraman PBEPBE/SDD
converged: NO YES NO NO
title: Mulliken charges:
elementType: S S N N C C C C C C H H H H H H H H H H H H
charge: -0.016341 0.007199 0.003350 -0.298369 -0.015872 -0.429865 -0.340117 -0.394827 -0.693480 -0.532013 0.249600 0.221830 0.208801 0.242580 0.233602 0.198307 0.224608 0.276259 0.217478 0.236430 0.239974 0.160868
chargesum: 0.00000
title: Mulliken charges with hydrogens summed into heavy atoms:
elementType: S S N N C C C C C C
charge: 0.144527 0.007199 0.003350 -0.022110 0.233728 0.000766 0.136065 0.028087 0.000402 -0.532013
polarizability: 1.38400399e+02 3.87232946e+00 1.23079626e+02 5.17388011e+00 8.22281785e+00 7.25814803e+01
1716.lowfreq: -15.1574 -12.9715 -8.3972 0.0028 0.0029 0.0033 36.4717 54.7962 152.7279
frequency: 36.4135 54.7495 152.7089 191.8827 207.1630 220.4776 268.5659 305.0737 316.4590 350.2689 371.0040 409.1690 427.5987 476.5391 517.3950 567.8645 611.7635 713.5223 729.6379 829.6444 870.5794 892.1187 896.1053 930.3696 974.5066 1019.8106 1054.5665 1070.6452 1093.9662 1123.8908 1142.7584 1177.8423 1212.2774 1252.5546 1278.9811 1296.7998 1337.4479 1344.5217 1358.3725 1376.0121 1389.4774 1429.4065 1441.3331 1458.3335 1460.1391 1464.8248 1472.0234 1485.7171 2464.7222 2875.0834 2880.2185 2990.5253 3002.1166 3037.6599 3047.7081 3051.6943 3086.5573 3093.8860 3101.8516 3478.6288
redmass: 3.8044 6.0415 2.6550 5.9891 1.1170 2.4637 4.3516 1.8874 1.4992 2.6490 4.6303 2.9198 2.9935 2.1178 4.1128 5.5622 2.1181 1.9686 2.9845 1.6493 2.7719 2.0621 1.7736 2.2430 1.9902 2.2235 2.0297 1.8596 2.1544 2.2252 2.3387 3.2812 1.2369 1.4398 1.1949 1.4080 1.2640 1.3829 1.3157 1.2447 1.3482 2.4158 1.3498 1.1359 1.1751 1.0774 1.1080 1.0582 1.0375 1.0713 1.0697 1.0358 1.0645 1.0856 1.0895 1.0910 1.0983 1.0979 1.1013 1.0758
irintensity: 0.4231 0.0871 1.0547 2.4873 0.9137 6.9686 4.4269 14.5645 22.9458 9.6523 6.2106 8.6317 3.2053 70.0285 32.8973 1.4229 48.4603 37.0909 23.1628 35.2534 18.9225 21.8462 1.6949 38.4118 39.5222 40.4867 24.7833 2.7237 30.5197 0.9893 61.1547 20.4797 41.3356 34.5478 6.6189 48.3143 25.8488 14.8430 8.1585 23.0965 3.3096 211.5964 7.0379 14.8660 26.6057 5.9139 17.3022 8.1526 3.1774 55.8114 126.3275 16.8248 26.7653 11.5690 44.1687 29.2783 36.5767 10.3867 13.5652 0.1635
temp: 298.150 k
press: 1.00000 atm
elementType: 16 16 7 7 6 6 6 6 6 6 1 1 1 1 1 1 1 1 1 1 1 1
symmnumber: 1
zpe: 467584.0 jmol-1
zpe.correction: 0.178093 hartree
zpe.thermalcorrener: 0.189106 hartree
zpe.thermalcorrenthalpy: 0.190050 hartree
zpe.thermalcorrgfe: 0.140663 hartree
zpe.sumelectzpe: -1140.647149 hartree
zpe.sumelectthermal: -1140.636137 hartree
zpe.sumelectthermalent: -1140.635193 hartree
zpe.sumelectthermalfe: -1140.684580 hartree
dipole: 4.0418 1.9937 -0.2291
dipole: 4.5126
quadrupole: -72.4135 -76.0300 -77.4015
quadrupole: -3.1504 -4.2759 -0.7883
quadrupole: 2.8682 -0.7483 -2.1198 -3.1504 -4.2759 -0.7883
hfenergy: -1140.8252427 hartree
pointgroup: C01 [X(C6H12N2S2)]
dipole: 1.6315722 -0.6971794 0.0628148 debye
dipolederiv: -0.1782655 -0.3276038 -0.043978 -0.4889825 -0.67265 -0.0055296 -0.072538 -0.0230124 -0.1340698 -0.5734969 0.1958166 0.0832891 0.2513098 -0.8101336 -0.1244185 0.1050523 -0.1290558 -0.236299 -1.4619211 0.1401165 0.1965694 0.0375617 -0.6100162 -0.0219334 -0.0058439 0.0032928 -0.2819724 -0.4766173 -0.0174256 0.1366188 -0.0316518 -0.5112241 0.0049045 0.221811 -0.0002677 -0.5349587 0.2373033 0.171636 -0.0096236 0.4721844 0.3067965 -0.1406969 0.093156 -0.0955128 0.2491942 0.2377188 -0.1797477 -0.1229958 -0.1963374 0.3475583 0.1042255 -0.0217256 0.0448913 0.3316293 0.1727204 -0.1680797 -0.0487639 -0.2693451 0.3122521 0.049864 -0.082211 0.0409598 0.2719324 0.3009239 0.2158255 -0.1026328 0.1847936 0.3435681 -0.0885475 0.016301 -0.0466032 0.3312455 -0.0383151 -0.018435 -0.0104542 -0.1064379 0.0273695 0.0716784 -0.0416922 0.0572164 -0.107441 1.6392647 -0.0855287 -0.2936904 0.0016816 1.3091714 0.241809 -0.2649141 0.2294331 -0.1099563 0.1383465 0.1034382 0.0447037 -0.0199532 -0.0049384 -0.019454 0.0027569 -0.0265306 0.017792 -0.0618504 -0.1055116 0.0057226 -0.0912144 -0.095863 -0.0146036 0.0283778 0.0101072 0.0952722 0.0175497 0.0850711 0.0933061 0.0363726 -0.0061675 0.0594507 0.045143 -0.050775 -0.2536087 -0.0084963 0.0721427 0.0606884 0.0898793 0.0474476 0.040395 0.0757071 -0.0299123 -0.1254807 -0.0137304 -0.110127 -0.0018292 -0.0714013 -0.0118238 0.0065867 0.0209057 0.0276928 0.0964422 -0.0144454 -0.1132503 0.0802546 -0.0527929 -0.0117504 0.0145134 0.0458143 0.1398615 -0.2158389 -0.0306711 0.106572 0.030295 0.077851 -0.1107001 -0.0477184 0.0418077 -0.0751733 0.0658605 0.0765438 0.0180133 -0.1025856 0.0385743 0.0941305 -0.0065945 -0.2600258 0.0060509 0.2249655 0.018727 -0.1085119 0.0130628 -0.1262754 -0.1043005 0.0197976 0.0340461 -0.0227473 0.0717013 0.0341934 0.0499049 0.0769267 0.0976641 0.008866 -0.1018595 0.0550963 -0.0414066 0.0530814 -0.0456672 0.0328786 -0.1187752 0.0178723 0.0907377 0.004835 -0.091199 0.0138688 0.0053414 0.0301852 0.0428059 0.0338917 0.1486474 0.06167 -0.046704 0.0541744 -0.0323774 0.1851678 unknown
polarizability: 138.2062752|-3.1724064|123.4499534|-8.0858365|5.2827056|72.4052759 unknown
InChI: InChI=1S/C6H12N2S2/c1-5-4-7-2-3-8(5)6(9)10/h5,7,9H,2-4H2,1H3
charge 0 multiplicity 1
22 atoms
S  -2.669621 -1.615674 0.017619
S  -2.604132 1.444198 0.492437
N  -0.403028 -0.096822 -0.095939
N  2.418313 -0.356262 0.256172
C  0.462843 1.132903 -0.095129
C  1.726821 0.850948 0.753293
C  0.2996 -1.350118 -0.483256
C  1.564846 -1.552332 0.377519
C  0.780953 1.583383 -1.536643
C  -1.74891 0.005561 0.131623
H  -0.132979 1.915887 0.405734
H  2.403973 1.719925 0.673179
H  1.41103 0.753434 1.821037
H  0.588024 -1.283628 -1.549386
H  -0.373633 -2.212399 -0.359179
H  1.246005 -1.758083 1.429389
H  2.109574 -2.437259 0.002124
H  3.357836 -0.481123 0.649461
H  1.275426 2.571411 -1.512917
H  1.462497 0.875142 -2.037685
H  -0.148574 1.683064 -2.123324
H  -3.872363 -1.016156 0.333573
