program: Gaussian 09
title: 000073426
version: EM64L-G09RevD.01
frameworkgroup: C1[X(C18H19NO3)]
method: RPBEPBE
basis: SDD
operation: Freq
keyword: #p
keyword: freq=noraman
keyword: PBEPBE/SDD
title: #p freq=noraman PBEPBE/SDD
converged: YES YES NO NO
title: Mulliken charges:
elementType: O O O N C C C C C C C C C C C C C C C C C C H H H H H H H H H H H H H H H H H H H
charge: -0.424838 -0.287161 -0.231832 -0.104353 -0.148214 0.080162 -0.567819 0.020274 0.212938 0.417608 -0.391788 -0.528409 -0.152513 -0.320766 -0.080330 -0.572350 -0.647983 0.203995 -0.359762 -0.342207 0.156022 -0.522031 0.206171 0.244908 0.247530 0.188638 0.218326 0.214355 0.233262 0.252101 0.268143 0.260805 0.187418 0.238485 0.232455 0.255074 0.262398 0.374751 0.229308 0.267863 0.209367
chargesum: 0.00000
title: Mulliken charges with hydrogens summed into heavy atoms:
elementType: O O O N C C C C C C C C C C C C C C C C C C
charge: -0.050087 -0.287161 -0.231832 -0.104353 0.057957 0.080162 -0.075382 0.020274 0.212938 0.417608 0.015175 -0.080793 0.099589 -0.052623 -0.080330 -0.311545 0.010375 0.203995 -0.104687 -0.079809 0.156022 0.184507
polarizability: 2.90744278e+02 -4.80822884e+00 2.21191715e+02 1.81771163e-01 -3.08628969e+00 1.36409943e+02
1716.lowfreq: -4.8497 -0.0006 -0.0005 -0.0004 5.1092 8.4615 38.2737 50.2693 61.6426
frequency: 38.2582 50.2346 61.6340 70.3360 85.4487 127.9639 131.8842 149.6813 178.7638 188.9384 208.0588 225.7144 232.4001 268.5395 276.0225 288.5586 296.1122 311.4897 346.4615 361.8591 399.3212 405.7309 409.7094 427.4199 441.5938 444.6712 490.2972 510.5749 536.0018 543.1565 567.6176 578.3200 595.4669 645.0078 665.6848 696.5518 718.4035 758.5000 761.3155 768.2524 792.4606 803.4454 825.4325 864.5090 889.6245 917.4329 924.9997 932.1217 948.5035 971.9538 996.4601 1000.3635 1012.6751 1018.9205 1042.5034 1050.5902 1060.9212 1078.7995 1093.4953 1112.8771 1113.6872 1137.2178 1154.5751 1159.8888 1164.8703 1183.7996 1185.9685 1204.2194 1223.4423 1239.1799 1244.9753 1254.6338 1275.2902 1301.4035 1302.4691 1309.2981 1343.1219 1343.8417 1371.4593 1371.8618 1379.0913 1391.4618 1424.4915 1430.5389 1439.9174 1448.9024 1455.5167 1459.8148 1465.8933 1471.7945 1478.0072 1481.3453 1488.7796 1558.8122 1592.6416 1606.4441 1627.5789 1645.6448 2765.1776 2839.3451 2859.9362 2974.9980 2979.2453 3008.5281 3029.2745 3030.6081 3041.7903 3084.9332 3085.0796 3088.1390 3105.0565 3111.6531 3128.8817 3147.9015 3149.8613 3154.6581 3488.8029
redmass: 8.0732 2.8028 3.3443 2.5115 3.7453 4.3981 1.6972 4.9327 2.5456 3.1631 2.5333 1.5428 2.4744 3.5825 3.9749 4.7873 3.1203 3.5572 3.8731 4.7984 3.4233 2.8366 2.2044 1.7266 4.0520 3.6350 3.6587 2.9385 3.9447 3.5280 4.9948 5.6812 4.7102 5.1248 4.3678 3.4827 3.0864 4.5286 6.2530 4.8653 1.5642 2.8978 2.7018 2.1915 1.4940 2.7110 3.3159 2.9624 2.9123 3.0612 1.3392 4.3926 1.2803 2.2233 2.9583 2.1767 1.9902 1.9963 3.2630 1.4489 1.2387 2.0527 1.3448 1.4322 1.5215 1.7694 1.3140 2.0290 1.4790 1.7374 1.6697 1.5956 1.7341 1.8948 2.0007 1.7616 1.4889 2.0758 1.4881 1.5904 2.3871 4.2291 2.2886 1.2249 1.5857 1.1233 1.0701 1.1185 1.0733 1.0954 1.0624 1.0726 3.6859 8.4793 8.2541 8.1012 8.7716 7.0029 1.0782 1.0700 1.0576 1.0352 1.0601 1.0601 1.0986 1.0727 1.0905 1.1029 1.0968 1.1023 1.0878 1.0877 1.1048 1.0914 1.0962 1.0980 1.0662
irintensity: 3.0466 3.6782 0.9117 1.6978 0.6014 0.8428 3.4481 0.5018 4.3037 2.1151 1.9708 1.7994 0.5397 4.1739 4.6224 3.2767 0.5129 2.7014 1.5069 3.4106 9.0291 9.2514 29.1233 40.2771 3.5600 10.6005 5.1488 0.6374 4.3815 8.1949 7.9706 0.8733 2.5917 10.5767 10.5635 14.3169 8.8040 2.4227 1.9054 5.0355 2.7871 5.2874 7.4829 63.0154 11.1272 20.1592 13.6815 13.1014 8.4194 32.7588 1.3643 14.4496 0.0484 13.1231 37.7829 13.8516 18.4431 17.1392 16.0089 6.2928 8.6907 18.3211 31.2718 43.3720 84.9921 19.5833 32.6487 13.9892 12.5224 58.8230 106.9102 8.2648 11.7048 2.5262 0.6773 12.2300 1.4240 43.7306 12.0105 7.0811 15.3779 9.9044 11.9138 14.2095 1.9169 14.8261 14.1782 9.1627 12.8063 16.1689 11.7869 42.3935 87.4499 168.4184 4.0215 19.9535 18.4735 143.1321 63.7761 60.0113 183.5855 89.6567 36.1814 15.2330 30.3739 41.4624 46.3625 29.2439 24.8517 31.0853 6.5502 4.4856 17.3653 6.1537 13.5769 2.6324 98.0271
temp: 298.150 k
press: 1.00000 atm
elementType: 8 8 8 7 6 6 6 6 6 6 6 6 6 6 6 6 6 6 6 6 6 6 1 1 1 1 1 1 1 1 1 1 1 1 1 1 1 1 1 1 1
symmnumber: 1
zpe: 863738.5 jmol-1
zpe.correction: 0.328981 hartree
zpe.thermalcorrener: 0.348647 hartree
zpe.thermalcorrenthalpy: 0.349591 hartree
zpe.thermalcorrgfe: 0.281598 hartree
zpe.sumelectzpe: -976.081650 hartree
zpe.sumelectthermal: -976.061984 hartree
zpe.sumelectthermalent: -976.061040 hartree
zpe.sumelectthermalfe: -976.129033 hartree
dipole: -4.4504 -1.7223 1.0700
dipole: 4.8905
quadrupole: -148.3682 -126.6039 -125.5473
quadrupole: 12.5692 -6.3590 4.3127
quadrupole: -14.8617 6.9026 7.9591 12.5692 -6.3590 4.3127
hfenergy: -976.4106308 hartree
pointgroup: C01 [X(C18H19N1O3)]
dipole: -1.5792664 1.0285418 -0.3874262 debye
polarizability: 289.6757696|-9.6390481|222.2622825|-3.0461313|-1.8671243|136.4078837 unknown
InChI: InChI=1S/C18H19NO3/c1-19-8-5-11-9-14(22-2)17(21)16-15(11)13(19)10-18(16)6-3-12(20)4-7-18/h3-4,6-7,9,13,21H,5,8,10H2,1-2H3
charge 0 multiplicity 1
41 atoms
O  1.077122 -2.458519 0.296838
O  -1.467407 -3.801485 0.202112
O  5.264521 0.323756 -0.464432
N  -2.2929 2.572443 0.300747
C  -1.129703 1.86672 -0.286072
C  1.048459 0.703403 0.079582
C  0.241809 2.040032 0.424157
C  -1.33958 0.373099 -0.192899
C  -0.121393 -0.309164 -0.026533
C  -2.58072 -0.27418 -0.151976
C  -3.532353 2.079859 -0.378849
C  -3.831905 0.589899 -0.076454
C  1.740747 0.836502 -1.2654
C  2.013312 0.36628 1.195235
C  -0.098528 -1.714437 0.08703
C  -2.56402 -1.686969 -0.055323
C  -2.166425 4.042704 0.201386
C  -1.34996 -2.411041 0.035476
C  3.088577 0.707265 -1.442941
C  3.364005 0.244439 1.020954
C  4.003215 0.420704 -0.311835
C  -0.599584 -4.671821 -0.62047
H  -1.015507 2.169939 -1.366054
H  0.808971 2.933587 0.113624
H  0.066182 2.080886 1.515759
H  -3.447075 2.222348 -1.488296
H  -4.379029 2.700273 -0.033322
H  -4.615247 0.231926 -0.772878
H  -4.251365 0.508531 0.945612
H  1.086222 1.040913 -2.123114
H  1.566311 0.242552 2.191617
H  -3.491203 -2.269473 -0.023105
H  -2.086902 4.406278 -0.855042
H  -1.269226 4.3800 0.748582
H  -3.046417 4.521011 0.665619
H  3.553326 0.810369 -2.430169
H  4.037743 0.022495 1.85701
H  1.847636 -1.850138 0.451541
H  -0.896528 -5.697187 -0.352769
H  0.464449 -4.502001 -0.391617
H  -0.788831 -4.494598 -1.697131
