program: Gaussian 09
title: 000062629
version: EM64L-G09RevD.01
frameworkgroup: C1[X(C14H14O6)]
method: RPBEPBE
basis: SDD
operation: Freq
keyword: #pfreq=noraman
keyword: PBEPBE/SDD
title: #p freq=noraman PBEPBE/SDD
converged: YES YES NO NO
title: Mulliken charges:
elementType: O O O O O O C C C C C C C C C C C C C C H H H H H H H H H H H H H H
charge: -0.294260 -0.292249 -0.267419 -0.281182 -0.229248 -0.241909 -0.039115 -0.041444 -0.352018 -0.348402 -0.285258 -0.288455 0.209390 0.145785 0.154534 0.189051 -0.369843 -0.332593 -0.216911 -0.219891 0.244748 0.251055 0.243350 0.217003 0.222596 0.229216 0.239619 0.248834 0.244273 0.241219 0.269692 0.267923 0.242049 0.239862
chargesum: 0.00000
title: Mulliken charges with hydrogens summed into heavy atoms:
elementType: O O O O O O C C C C C C C C C C C C C C
charge: -0.294260 -0.292249 -0.267419 -0.281182 -0.229248 -0.241909 0.205633 0.209610 0.108334 0.103410 0.203195 0.197037 0.209390 0.145785 0.154534 0.189051 -0.100150 -0.064670 0.025138 0.019971
polarizability: 2.02096798e+02 -9.21894116e+00 2.04694738e+02 1.54342338e+00 1.32565581e+01 1.02668649e+02
1716.lowfreq: -3.2286 0.0006 0.0007 0.0008 3.5683 4.1401 15.9772 26.2240 30.2659
frequency: 15.5037 25.9810 30.1870 42.6588 46.5988 54.5451 76.1861 88.1022 95.7465 133.0865 144.6134 181.8277 215.0402 220.2415 259.9680 273.3258 277.0948 309.9736 354.3145 395.5862 400.2237 414.0915 437.1456 440.4511 532.2422 556.8386 640.2362 666.0883 675.2293 703.0111 730.6073 740.6822 780.6586 788.0591 793.6877 795.6339 802.3858 824.6040 888.5270 895.5826 896.3413 906.4493 914.1663 957.9981 969.5911 978.1578 1005.8558 1023.9216 1027.5706 1030.8872 1036.3189 1077.9591 1093.5342 1097.7280 1113.5516 1119.7598 1121.8221 1141.2701 1143.6620 1178.7834 1200.8585 1205.0346 1225.6796 1237.2587 1240.2478 1245.5360 1279.9844 1337.2281 1341.1272 1381.2635 1409.4642 1413.6345 1430.2772 1464.2291 1465.0507 1476.8421 1481.9552 1487.8313 1578.9256 1602.4812 1622.6356 1624.6181 3014.7376 3022.7657 3071.0707 3072.9614 3080.2164 3090.9071 3116.9171 3117.0996 3140.3120 3154.5464 3168.6990 3180.3733 3180.8287 3184.4167
redmass: 5.6473 3.9565 4.0246 5.0944 4.7910 4.8693 5.1026 4.6531 4.9919 5.1340 5.1774 5.9640 6.5057 6.1297 5.1459 4.7889 5.8700 7.6401 8.2133 2.2378 2.4652 3.6591 5.0176 4.5524 5.1777 5.2607 6.5816 6.2827 6.8698 4.2110 7.3270 7.6452 3.6844 1.6825 4.4391 5.1713 5.1315 6.9315 1.1871 2.6779 1.2403 2.5396 3.6520 2.0379 1.8784 1.4029 1.3560 1.3997 2.0666 2.3250 3.6889 3.3546 1.4065 1.3784 1.3545 1.8348 1.3010 1.5545 1.5851 1.0620 1.2929 1.2998 3.2795 1.5635 1.5277 2.3523 1.5332 1.4320 1.4481 11.0203 2.0708 2.0390 2.2151 1.1219 1.1134 2.5750 1.2043 1.1855 7.2071 6.4375 11.5075 11.9628 1.0575 1.0578 1.0533 1.0529 1.1060 1.1047 1.0934 1.0940 1.0864 1.0911 1.0962 1.0984 1.1191 1.1195
irintensity: 0.4893 1.0416 0.2475 0.8499 2.4600 0.5949 0.2547 0.3448 11.9478 0.8602 1.5442 6.4871 1.6965 4.6841 8.6706 12.4251 12.0965 14.3409 12.4108 4.0118 2.8785 4.0989 4.1498 3.0254 0.1901 7.7680 3.2774 5.6611 2.9269 62.9130 8.8364 1.1186 15.6699 49.1567 32.4865 42.9195 7.5331 1.1294 4.0365 19.9030 3.8744 4.7364 6.0510 20.6455 14.1983 3.5076 1.7095 25.4094 72.5044 73.4567 146.8645 266.9152 7.8619 4.3371 15.3201 31.8694 14.4310 9.2438 13.3303 0.4052 4.5787 2.6239 152.2043 39.5026 26.3576 279.5984 34.1106 3.1378 4.5967 9.7151 3.6514 2.6820 7.7554 18.1516 1.8277 16.4445 2.9455 4.5238 24.9345 35.5989 255.8132 94.7942 13.6165 17.0165 21.5037 18.5278 12.9786 7.0086 0.1875 36.0403 1.6481 7.3223 10.5648 11.8592 27.1165 22.3526
temp: 298.150 k
press: 1.00000 atm
elementType: 8 8 8 8 8 8 6 6 6 6 6 6 6 6 6 6 6 6 6 6 1 1 1 1 1 1 1 1 1 1 1 1 1 1
symmnumber: 1
zpe: 669489.5 jmol-1
zpe.correction: 0.254995 hartree
zpe.thermalcorrener: 0.274411 hartree
zpe.thermalcorrenthalpy: 0.275355 hartree
zpe.thermalcorrgfe: 0.202806 hartree
zpe.sumelectzpe: -991.655232 hartree
zpe.sumelectthermal: -991.635816 hartree
zpe.sumelectthermalent: -991.634872 hartree
zpe.sumelectthermalfe: -991.707421 hartree
dipole: -2.0852 -5.5047 -2.7359
dipole: 6.4912
quadrupole: -120.6983 -113.5163 -117.5300
quadrupole: 1.5497 -6.2214 -1.0336
quadrupole: -3.4501 3.7319 -0.2818 1.5497 -6.2214 -1.0336
hfenergy: -991.9102271 hartree
pointgroup: C01 [X(C14H14O6)]
dipole: -1.5780487 -1.5907654 -1.2252357 debye
polarizability: 192.8541204|-5.4841098|211.7411569|16.5331453|9.4762571|104.8649076 unknown
InChI: InChI=1S/C14H14O6/c15-13(19-7-9-5-17-9)11-3-1-2-4-12(11)14(16)20-8-10-6-18-10/h1-4,9-10H,5-8H2
charge 0 multiplicity 1
34 atoms
O  3.350854 3.59463 -0.07575
O  -4.254417 3.066876 -0.573932
O  2.255354 0.025053 -0.368194
O  -1.757707 0.24743 -0.418755
O  3.174468 -1.401201 1.231713
O  -0.06712 0.552325 1.151931
C  2.842436 2.324463 -0.719493
C  -3.418529 1.88188 -0.997638
C  1.872398 3.268208 -0.082451
C  -4.825098 1.666147 -0.533827
C  3.259341 1.065474 0.003615
C  -2.245715 1.615936 -0.083648
C  1.110303 -2.025058 0.083467
C  -0.229466 -1.565021 -0.080644
C  2.266126 -1.126779 0.414095
C  -0.62137 -0.169478 0.290425
C  1.404907 -3.396929 -0.099189
C  -1.234065 -2.483296 -0.479317
C  0.395416 -4.305229 -0.48318
C  -0.924594 -3.843673 -0.687888
H  2.930089 2.312327 -1.81296
H  -3.205845 1.843694 -2.073192
H  1.448085 3.007066 0.89427
H  1.266044 3.924061 -0.718822
H  -5.002094 1.273322 0.475237
H  -5.610886 1.469206 -1.272251
H  4.2631 0.719514 -0.300795
H  3.247914 1.210033 1.097658
H  -1.424912 2.337237 -0.249182
H  -2.538071 1.65958 0.980437
H  2.433723 -3.737054 0.055368
H  -2.257756 -2.120343 -0.604093
H  0.638919 -5.363215 -0.625455
H  -1.711632 -4.541186 -0.992759
