program: Gaussian 09
title: 000062575
version: EM64L-G09RevD.01
frameworkgroup: C1[X(C11H22O2)]
method: RPBEPBE
basis: SDD
operation: Freq
keyword: #pfreq=noraman
keyword: PBEPBE/SDD
title: #p freq=noraman PBEPBE/SDD
converged: NO YES NO NO
title: Mulliken charges:
elementType: O O C C C C C C C C C C C H H H H H H H H H H H H H H H H H H H H H H
charge: -0.277163 -0.232263 0.149905 -0.364187 -0.390953 -0.349183 -0.275237 -0.355065 0.233587 -0.698688 -0.693146 -0.698654 -0.694188 0.191097 0.191062 0.209102 0.209130 0.189788 0.189850 0.223246 0.223015 0.195818 0.195792 0.216611 0.211960 0.238359 0.225913 0.203564 0.226474 0.238052 0.212258 0.216838 0.216937 0.210154 0.210215
chargesum: 0.00000
title: Mulliken charges with hydrogens summed into heavy atoms:
elementType: O O C C C C C C C C C C C
charge: -0.277163 -0.232263 0.149905 0.017971 0.027278 0.030455 0.171024 0.036545 0.233587 -0.031759 -0.037194 -0.031506 -0.056882
polarizability: 1.61306149e+02 1.22665429e+00 1.16342611e+02 -2.36364442e-02 -1.77527285e-02 1.04335735e+02
1716.lowfreq: -15.6429 -2.4220 -0.0007 -0.0005 -0.0001 3.2904 23.5632 31.7276 45.8214
frequency: 20.7133 31.6285 45.5994 47.5135 72.7635 104.3741 125.6661 135.2897 149.0783 169.9315 188.5335 229.3116 231.2503 232.9369 252.6618 271.3051 299.7796 339.4601 349.4559 366.5336 422.4833 437.1516 523.1220 566.2500 719.4651 725.1919 746.3633 771.5671 793.4638 850.8803 883.0222 888.6989 926.9237 931.7085 939.7153 951.9843 985.8122 1011.9509 1024.8992 1025.5098 1050.0859 1071.1189 1083.8078 1102.8028 1127.1250 1149.4601 1195.5727 1207.5244 1228.4348 1237.8414 1243.2662 1264.7002 1271.8972 1290.4698 1292.7381 1293.0433 1339.3742 1357.6585 1371.1501 1371.7383 1379.8245 1392.0840 1403.4566 1452.3821 1463.9513 1464.7244 1466.4116 1468.2639 1470.9438 1472.8578 1476.9587 1478.1853 1478.3640 1485.2505 1490.1725 1497.5748 1621.2107 2956.4536 2960.9219 2970.7818 2974.5751 2982.6746 2984.0996 2989.8271 2991.1488 2993.0414 2999.8992 3009.3210 3031.5100 3045.1670 3070.6995 3073.6073 3074.0052 3075.3575 3078.3649 3089.5143 3095.2441 3100.2612 3103.7363
redmass: 2.8782 2.8002 2.4372 3.7957 3.2921 1.6913 3.5284 2.3047 2.0356 1.0544 4.3713 1.1531 1.2101 2.2833 1.1586 2.4244 3.2294 3.0984 2.9497 2.3362 3.3089 2.9578 4.1492 3.2964 6.6699 1.0694 1.0954 5.4906 1.1542 3.4943 1.1971 1.9418 4.0144 1.7348 1.6938 1.1999 1.1438 3.7752 1.4193 1.4805 3.0475 2.6893 2.1674 4.0087 2.7922 1.4728 1.5234 2.8677 2.7671 1.3359 1.2858 3.0677 1.1146 1.0838 1.3197 1.1155 1.4183 1.6311 1.1842 1.4607 1.2507 1.2183 1.2161 1.0492 1.0526 1.0734 1.0707 1.0464 1.0759 1.0504 1.0629 1.0428 1.0648 1.0792 1.0942 1.0691 10.6778 1.0590 1.0590 1.0591 1.0366 1.0348 1.0353 1.0594 1.0362 1.0979 1.0567 1.1015 1.1037 1.1046 1.1015 1.1064 1.0993 1.1010 1.0998 1.0998 1.1002 1.0999 1.0995
irintensity: 0.0150 0.0601 0.7662 0.3519 0.0351 0.9238 0.9115 0.0480 1.1301 0.1961 1.0898 0.3253 0.6732 0.3868 0.1030 3.7752 8.0994 5.1344 0.0913 0.3232 8.8089 0.7280 2.0751 0.6378 2.3851 12.5557 0.0655 5.1819 1.6502 13.4713 1.1199 6.8023 13.8215 2.8253 2.3505 0.0211 0.1363 0.2600 2.6181 27.3016 11.7031 36.6095 43.4505 408.3870 1.9351 1.4328 0.0461 6.1892 11.3274 9.2834 0.0143 18.1009 0.0403 0.1338 1.5663 0.8207 0.5856 0.2047 17.7043 5.5787 19.9763 11.8270 15.9996 0.0331 0.0281 0.0596 0.1282 0.0053 1.4949 13.9168 7.3200 12.3952 6.9412 5.4757 25.6331 35.8696 183.0331 0.0433 7.8982 88.0338 34.9385 34.5948 16.2175 18.3277 31.3710 0.3312 47.0114 0.5027 28.9435 21.7790 36.2761 101.5861 53.5562 40.3746 24.6225 52.7789 16.9070 18.3826 48.5698
temp: 298.150 k
press: 1.00000 atm
elementType: 8 8 6 6 6 6 6 6 6 6 6 6 6 1 1 1 1 1 1 1 1 1 1 1 1 1 1 1 1 1 1 1 1 1 1
symmnumber: 1
zpe: 813177.0 jmol-1
zpe.correction: 0.309723 hartree
zpe.thermalcorrener: 0.327044 hartree
zpe.thermalcorrenthalpy: 0.327988 hartree
zpe.thermalcorrgfe: 0.262788 hartree
zpe.sumelectzpe: -581.746269 hartree
zpe.sumelectthermal: -581.728947 hartree
zpe.sumelectthermalent: -581.728003 hartree
zpe.sumelectthermalfe: -581.793203 hartree
dipole: -1.2539 -1.7552 0.0096
dipole: 2.1571
quadrupole: -78.6589 -88.5627 -80.4519
quadrupole: -7.5609 0.0210 0.0208
quadrupole: 3.8990 -6.0049 2.1059 -7.5609 0.0210 0.0208
hfenergy: -582.0559913 hartree
pointgroup: C01 [X(C11H22O2)]
dipole: -0.4943824 -0.6897698 0.0065597 debye
polarizability: 161.3096953|1.1569203|116.3386846|-0.094262|-0.0575788|104.3361151 unknown
InChI: InChI=1S/C11H22O2/c1-5-6-7-8-9-13-10(12)11(2,3)4/h5-9H2,1-4H3
charge 0 multiplicity 1
35 atoms
O  1.010859 -0.113042 0.000537
O  2.281005 1.832572 -0.014569
C  3.423706 -0.389994 -0.005493
C  -2.763545 0.526446 0.002161
C  -1.416721 -0.234159 0.003059
C  -3.984487 -0.420431 0.005296
C  -0.224447 0.722403 0.000913
C  -5.336089 0.329118 0.001336
C  2.227055 0.580039 -0.006757
C  3.337547 -1.299975 -1.265377
C  4.733422 0.432187 -0.024774
C  3.355876 -1.26926 1.27741
C  -6.550608 -0.623532 0.005255
H  -2.815268 1.192134 0.888679
H  -2.816621 1.187678 -0.887623
H  -1.35652 -0.892053 -0.885239
H  -1.356123 -0.889213 0.893416
H  -3.934257 -1.08818 -0.879814
H  -3.935392 -1.080926 0.895865
H  -0.21071 1.372291 -0.894079
H  -0.20858 1.37402 0.894628
H  -5.384855 0.996921 0.885477
H  -5.384155 0.988784 -0.888954
H  3.377236 -0.701069 -2.193491
H  4.194449 -1.998459 -1.272724
H  2.403351 -1.885693 -1.266333
H  4.790625 1.069669 -0.923898
H  5.601792 -0.251492 -0.020767
H  4.801417 1.09422 0.855595
H  2.421422 -1.85392 1.306128
H  4.212298 -1.968284 1.288888
H  3.409696 -0.648122 2.190065
H  -7.504055 -0.064498 -0.000486
H  -6.539629 -1.28273 -0.883169
H  -6.543494 -1.271048 0.902239
