program: Gaussian 09
title: 000073500
version: EM64L-G09RevD.01
frameworkgroup: C1[X(C18H20N4O5)]
method: RPBEPBE
basis: SDD
operation: Freq
keyword: #p
keyword: freq=noraman
keyword: PBEPBE/SDD
title: #p freq=noraman PBEPBE/SDD
converged: YES YES NO NO
title: Mulliken charges:
elementType: O O O O O N N N N C C C C C C C C C C C C C C C C C C H H H H H H H H H H H H H H H H H H H H
charge: -0.253352 -0.316926 -0.247484 -0.257826 -0.267121 -0.318982 -0.196130 -0.402991 -0.620813 -0.304403 0.293171 -0.223130 -0.406871 -0.228937 0.087490 0.185016 -0.309844 -0.063736 -0.243792 -0.545396 0.264465 0.211356 -0.836824 0.310673 -0.423831 0.161455 -0.450777 0.268626 0.258993 0.270132 0.251112 0.276860 0.282591 0.233911 0.287332 0.213314 0.235891 0.239547 0.227753 0.222636 0.293275 0.368450 0.266648 0.253721 0.329923 0.342847 0.281977
chargesum: 0.00000
title: Mulliken charges with hydrogens summed into heavy atoms:
elementType: O O O O O N N N N C C C C C C C C C C C C C C C C C C
charge: -0.253352 -0.316926 -0.247484 -0.257826 -0.267121 -0.048850 -0.196130 -0.034542 0.051957 -0.035777 0.293171 0.035863 0.121101 0.053654 0.087490 0.185016 0.211399 -0.063736 -0.243792 0.143357 0.264465 0.211356 -0.093160 0.310673 0.096537 0.161455 -0.168800
polarizability: 3.17764595e+02 4.75969760e+01 2.77469771e+02 -9.02630049e+00 1.45954314e+01 1.58141475e+02
1716.lowfreq: -4.6222 -1.5326 -0.0006 0.0001 0.0009 7.7206 14.7398 24.6016 33.9378
frequency: 14.6082 24.5888 33.9214 39.5123 44.6590 58.6691 67.8279 87.5904 92.0595 99.5359 127.6704 138.2686 155.7684 158.4690 167.5390 170.1153 185.4326 198.9478 207.5630 221.8589 229.6243 244.5274 280.5685 300.7806 312.7651 318.5178 326.0917 340.8677 372.1835 402.3349 409.0008 413.5687 448.1089 469.7455 479.3745 486.9005 498.7139 504.5094 507.6656 547.8472 564.1765 587.7111 629.4101 636.5264 644.4243 681.4127 695.5140 703.4629 714.5312 725.5359 738.1508 753.5747 775.8489 780.8220 799.4966 807.2567 840.8293 887.1434 899.1713 920.8002 938.9760 945.8482 955.5270 964.9748 980.0897 989.0424 998.8636 1011.7800 1036.9536 1039.1109 1054.3283 1057.5462 1070.1628 1079.8422 1089.8034 1112.9073 1119.2789 1122.3948 1130.9011 1151.4121 1175.1511 1189.4918 1201.0187 1212.7856 1222.3931 1227.0065 1238.8230 1280.1722 1285.7212 1293.3425 1299.7135 1312.7881 1315.7053 1337.9759 1350.9177 1373.5167 1380.1612 1395.2195 1435.6938 1452.5474 1461.8099 1466.5949 1474.8011 1476.8122 1477.9684 1485.1070 1491.5301 1503.7177 1507.2656 1564.6130 1589.8782 1593.0958 1610.6514 1693.3652 2155.7167 2957.5890 2958.3705 2978.1876 3015.0879 3017.4543 3029.7589 3044.8682 3053.0898 3063.7442 3093.1228 3098.0860 3098.4663 3108.0142 3167.7720 3188.7056 3321.9423 3323.6075 3426.0500 3559.5871 3716.6951
redmass: 5.7150 7.2938 6.2044 4.6168 5.1444 3.1842 5.0823 3.7349 4.9119 3.4791 6.2946 3.5591 2.7297 3.5597 4.0161 4.9843 1.0817 1.9719 5.0565 3.0006 4.9185 4.6916 4.0719 4.3230 3.1287 5.3336 2.9470 2.9271 5.5986 6.1384 6.6710 4.3170 3.7832 6.8139 7.0001 1.1963 5.5607 1.3124 2.7349 5.8627 5.4829 5.0305 4.7646 5.3396 1.2298 1.2639 5.4873 10.7778 4.9418 3.7224 9.9080 4.7978 2.2301 1.8734 3.8405 4.1226 5.6181 3.1426 2.6417 3.8629 2.7193 1.4733 2.8904 2.1640 3.5563 2.2631 5.7255 3.1373 2.2960 1.4476 3.4270 2.1384 2.4582 2.0655 3.8527 1.7419 1.4329 1.9244 1.6091 1.6822 1.7253 1.9805 1.5052 1.3460 1.1154 1.4620 1.4586 2.3207 1.9439 2.3034 1.6022 1.4517 2.8045 2.0229 1.9503 1.6641 6.8921 1.2566 1.1257 1.2142 1.0601 2.1725 1.3340 1.0974 1.1700 1.0568 2.1098 1.5572 2.1786 8.6388 1.2110 5.6741 8.8539 7.5984 5.9807 1.0663 1.0320 1.0419 1.0819 1.0637 1.0584 1.1032 1.0899 1.0941 1.0981 1.1074 1.1018 1.1004 1.0915 1.0949 1.0757 1.0758 1.1614 1.0445 1.1058
irintensity: 0.8041 0.1498 2.4496 4.8384 1.8486 1.2687 0.6590 1.5092 1.8683 3.7333 0.8828 1.6619 3.0479 3.9424 7.3503 6.3694 0.2598 4.1568 2.1966 4.1648 0.9569 4.9646 0.5621 3.3220 10.1783 2.8539 1.8938 9.5372 22.8548 10.2330 3.4174 8.2299 2.7540 25.4574 5.2322 257.4934 4.5573 32.8560 15.6217 8.8675 13.6620 2.5037 9.6684 13.1937 71.1122 60.9477 3.0501 23.5790 30.3760 36.7437 11.5179 8.7664 53.7379 31.1744 11.3003 10.0801 39.3595 18.5312 18.0566 11.0303 12.8631 4.1073 0.9998 9.4381 43.9647 25.6529 175.6186 154.9701 12.9488 1.4622 45.1407 12.8076 61.3483 20.8589 4.5388 31.5107 12.3120 37.1609 11.1105 13.1493 19.0978 0.9925 12.1883 17.2676 23.1017 10.0009 18.0759 21.5568 53.0716 386.7393 69.9294 27.3937 99.5210 6.0637 46.7171 45.9488 58.8126 29.6975 10.5549 164.9601 5.8733 194.9513 105.9096 9.2194 116.0091 18.8706 195.0309 238.7410 77.9392 48.3288 125.2618 402.4591 2.4007 330.3855 0.0770 16.9251 63.2176 52.3772 2.0243 23.3515 11.1821 37.9897 5.7671 24.8714 4.2334 7.1259 3.8615 23.7312 16.0469 13.8362 5.5784 102.8682 83.7062 60.0718 49.7428
temp: 298.150 k
press: 1.00000 atm
elementType: 8 8 8 8 8 7 7 7 7 6 6 6 6 6 6 6 6 6 6 6 6 6 6 6 6 6 6 1 1 1 1 1 1 1 1 1 1 1 1 1 1 1 1 1 1 1 1
symmnumber: 1
zpe: 948501.8 jmol-1
zpe.correction: 0.361265 hartree
zpe.thermalcorrener: 0.387917 hartree
zpe.thermalcorrenthalpy: 0.388862 hartree
zpe.thermalcorrgfe: 0.302493 hartree
zpe.sumelectzpe: -1290.935331 hartree
zpe.sumelectthermal: -1290.908679 hartree
zpe.sumelectthermalent: -1290.907735 hartree
zpe.sumelectthermalfe: -1290.994104 hartree
dipole: -1.2456 0.2679 2.6229
dipole: 2.9160
quadrupole: -109.2967 -166.0630 -165.1382
quadrupole: 3.3608 -16.5021 8.8117
quadrupole: 37.5360 -19.2304 -18.3056 3.3608 -16.5021 8.8117
hfenergy: -1291.2965965 hartree
pointgroup: C01 [X(C18H20N4O5)]
dipole: 0.4582271 0.1605731 -1.0394171 debye
polarizability: 319.7582326|-46.2450744|275.7719302|-14.9551949|-8.8659773|157.8456785 unknown
InChI: InChI=1S/C18H20N4O5/c1-4-5-20-12-8(2)14(23)13-11(15(12)24)9(7-27-17(19)25)18(26-3)16-10(21-16)6-22(13)18/h1,9-10,16,20-21H,5-7,19H2,2-3H3
charge 0 multiplicity 1
47 atoms
O  2.344424 -1.075591 -2.154134
O  3.024322 2.03312 -0.108501
O  -1.403754 -3.336261 0.397744
O  -1.510458 2.137036 -0.325857
O  3.234535 3.350808 1.837594
N  2.862375 -1.445053 1.644115
N  0.966352 -1.843282 -0.404058
N  -3.773896 0.956945 0.162173
N  4.889016 3.312218 0.170718
C  3.139268 -1.140066 0.183528
C  1.968029 -0.794314 -0.752213
C  2.932197 -2.580492 0.643346
C  1.603153 -3.093626 0.061655
C  1.176333 0.565267 -0.637681
C  -0.265465 -1.292005 -0.171044
C  -0.240054 0.093042 -0.323088
C  1.69895 1.5757 0.391051
C  -1.497955 -2.066335 0.203773
C  -1.434667 0.856397 -0.201174
C  3.456669 -0.265603 -2.678395
C  -2.742276 -1.318171 0.334076
C  -2.731449 0.071562 0.119971
C  -3.964928 -2.145961 0.702668
C  3.687265 2.94833 0.740342
C  -5.207024 0.723727 0.414813
C  -6.018113 1.860764 -0.055641
C  -6.707985 2.810026 -0.428389
H  4.117813 -0.703088 -0.016842
H  3.755147 -3.285066 0.780398
H  1.881345 -1.236102 1.92046
H  1.792098 -3.772668 -0.789502
H  0.943872 -3.603881 0.781612
H  1.20188 1.051344 -1.631065
H  1.826341 1.143431 1.398496
H  1.014883 2.438682 0.45521
H  4.434697 -0.629688 -2.307469
H  3.343162 0.80457 -2.418607
H  3.414089 -0.393419 -3.771269
H  -4.63762 -2.31466 -0.159912
H  -4.552877 -1.700862 1.52327
H  -3.618578 -3.139582 1.031474
H  -3.462245 1.931966 -0.001635
H  -5.534058 -0.1972 -0.097284
H  -5.394692 0.577058 1.498732
H  5.167571 2.951053 -0.73778
H  5.480249 3.970732 0.669645
H  -7.306642 3.638995 -0.760324
