program: Gaussian 09
title: 000062524
version: EM64L-G09RevD.01
frameworkgroup: C1[X(C18H23Cl5O2)]
method: RPBEPBE
basis: SDD
operation: Freq
keyword: #p
keyword: freq=noraman
keyword: PBEPBE/SDD
title: #p freq=noraman PBEPBE/SDD
converged: YES YES NO NO
title: Mulliken charges:
elementType: Cl Cl Cl Cl Cl O O C C C C C C C C C C C C C C C C C C H H H H H H H H H H H H H H H H H H H H H H H
charge: 0.054077 0.055515 0.061838 0.061865 0.067806 -0.289511 -0.178197 -0.384341 -0.386316 -0.382037 -0.375138 -0.372670 -0.388033 -0.353460 -0.374916 -0.356514 -0.524731 -0.696515 0.244954 0.733054 -0.304447 -0.306917 -0.086676 -0.085640 -0.119556 0.194977 0.191696 0.198078 0.191848 0.193762 0.191272 0.187947 0.199267 0.190228 0.188620 0.227147 0.189276 0.188432 0.187261 0.220464 0.209419 0.194358 0.195088 0.259674 0.253282 0.214999 0.209975 0.209440
chargesum: 0.00000
title: Mulliken charges with hydrogens summed into heavy atoms:
elementType: Cl Cl Cl Cl Cl O O C C C C C C C C C C C C C C C C C C
charge: 0.054077 0.055515 0.061838 0.061865 0.067806 -0.289511 -0.178197 0.002331 0.003610 0.002997 0.012076 0.006177 0.028390 0.022232 0.054967 0.032932 -0.011775 -0.062101 0.244954 0.733054 -0.304447 -0.306917 -0.086676 -0.085640 -0.119556
polarizability: 3.20282403e+02 -8.81805124e-01 2.73749351e+02 3.63876670e+01 7.51631849e+00 1.73341725e+02
1716.lowfreq: -19.6649 -0.0019 -0.0012 0.0020 2.1864 5.1356 6.6331 8.8598 13.0176
frequency: -17.7405 8.1572 12.6521 18.6880 25.0535 36.9988 43.1549 54.9722 64.4711 67.3036 72.6242 81.2965 102.9422 107.4056 109.1081 121.5265 140.0673 145.4721 169.5957 183.9724 191.0701 198.6822 200.5780 204.1712 213.1353 223.3150 235.7132 261.4088 293.4153 306.3595 316.6592 318.5573 328.3036 349.9581 358.8327 381.2106 401.9651 470.1516 480.5711 521.0330 539.6101 572.8143 590.8695 612.0872 659.3681 664.9521 712.7953 716.8024 719.9953 727.4985 742.3486 761.7392 787.7819 809.3633 822.9350 838.1353 856.2584 887.3195 901.9886 921.1045 961.8688 978.4603 998.7072 1005.4482 1019.9387 1025.3675 1043.2311 1063.3857 1067.1550 1072.8442 1081.6964 1083.6588 1085.5472 1121.5735 1131.1347 1181.5983 1189.6095 1210.1144 1219.0473 1229.1644 1241.3700 1248.6834 1267.2554 1277.2042 1278.4705 1285.1163 1286.7475 1292.7266 1295.4416 1306.3908 1326.8952 1331.0952 1338.8337 1341.3996 1349.3303 1354.9327 1357.1813 1357.7467 1363.1589 1388.0153 1432.8188 1456.4690 1458.3693 1459.4248 1462.4284 1463.3885 1468.5185 1474.2457 1475.9698 1479.9053 1484.8307 1487.5880 1534.0301 1544.5007 1701.1540 2947.4409 2947.9688 2950.3147 2950.9099 2954.9221 2959.7873 2964.2033 2967.4661 2970.2439 2981.4162 2983.3098 2985.5593 2991.6023 2994.0831 3000.5166 3011.4555 3021.4612 3031.0645 3039.8086 3049.0237 3061.1992 3066.5319 3069.6039
redmass: 1.7225 11.1991 5.1263 7.7548 4.9941 5.5693 5.0155 3.2780 1.9196 20.6251 5.1575 8.9418 3.8805 2.0822 2.8503 3.7606 1.8620 2.2325 4.9361 7.7625 3.6003 10.0285 30.3272 6.5142 34.5942 1.1153 5.0549 3.3116 14.7751 3.5696 14.7744 12.5047 17.2975 12.6173 20.6735 3.8751 3.1683 3.6953 2.8977 3.6570 5.0723 7.3264 12.0754 13.1082 4.1132 13.9639 8.5511 1.0596 1.0795 1.1641 1.4315 2.2593 1.8486 2.7869 12.8010 1.7443 1.6541 1.8841 1.5049 4.6033 1.5318 2.8208 4.0892 3.3285 1.3239 2.9464 2.9937 3.6580 3.2966 3.0623 2.0350 2.2450 1.9345 2.5943 1.8784 1.7482 1.3181 1.4691 1.3479 11.4125 1.3611 1.3018 1.2768 1.2674 1.0294 1.1672 1.0609 1.1149 1.1120 1.3208 11.6366 1.4088 11.8830 1.7336 1.5231 1.7166 1.7440 5.1899 1.6034 1.2178 1.0869 1.0777 1.0751 1.0738 1.0632 1.0789 1.0836 1.0831 1.0427 1.0880 1.0928 1.0922 11.9876 11.9759 10.7549 1.0590 1.0589 1.0594 1.0594 1.0597 1.0601 1.0604 1.0586 1.0367 1.0960 1.0647 1.0955 1.0967 1.0653 1.1005 1.1020 1.1033 1.1044 1.1044 1.1007 1.0988 1.1008 1.0993
irintensity: 0.0139 0.0110 0.0184 0.0872 0.0588 0.3932 0.2949 0.9682 0.2213 0.0057 0.2970 0.2751 0.0878 0.0305 0.1042 0.6204 0.0038 0.1703 0.9441 0.0729 0.5266 0.0975 0.1324 0.0636 0.0000 0.0010 0.8380 6.6088 0.2578 3.4677 0.3244 0.1124 0.3246 0.0053 0.2173 3.2811 5.2363 4.0378 0.0274 1.3636 0.6129 2.3194 0.0395 11.2579 0.4596 69.0057 27.4380 18.0720 0.0736 3.3417 13.1040 35.6860 6.5455 47.4911 0.2001 28.5774 8.8127 5.8386 8.8255 29.1386 61.9592 32.4787 125.3188 52.1293 101.5548 263.0858 34.9229 2.0714 4.9263 2.3965 0.0571 0.6779 3.5570 16.0973 40.4267 3.3593 9.7390 2.1340 2.7166 2.5252 2.9186 1.0940 4.5138 0.2231 0.2590 1.7662 0.8701 1.4155 2.8915 1.4597 118.4844 2.2649 38.5543 154.4018 3.2445 0.5944 10.4099 123.0840 0.6149 11.2433 34.3647 3.4538 0.0298 1.5007 0.1611 0.5896 1.2378 1.7984 12.3466 2.5180 4.8343 33.7714 0.7524 2.2051 128.8640 0.0351 0.0562 0.0920 3.5028 0.8794 14.2668 63.0704 189.1561 37.2084 0.2616 41.2417 5.1223 1.9761 22.6359 2.0433 1.5355 2.1606 1.0094 158.4171 73.0142 50.6828 101.6095 56.3481
temp: 298.150 k
press: 1.00000 atm
elementType: 17 17 17 17 17 8 8 6 6 6 6 6 6 6 6 6 6 6 6 6 6 6 6 6 6 1 1 1 1 1 1 1 1 1 1 1 1 1 1 1 1 1 1 1 1 1 1 1
symmnumber: 1
zpe: 969019.4 jmol-1
zpe.correction: 0.369080 hartree
zpe.thermalcorrener: 0.397891 hartree
zpe.thermalcorrenthalpy: 0.398836 hartree
zpe.thermalcorrgfe: 0.302371 hartree
zpe.sumelectzpe: -3148.520187 hartree
zpe.sumelectthermal: -3148.491376 hartree
zpe.sumelectthermalent: -3148.490432 hartree
zpe.sumelectthermalfe: -3148.586897 hartree
dipole: 1.6486 -1.7475 1.5011
dipole: 2.8328
quadrupole: -188.0107 -179.4243 -186.4006
quadrupole: -2.1568 0.4720 -3.4262
quadrupole: -3.3988 5.1876 -1.7887 -2.1568 0.4720 -3.4262
hfenergy: -3148.8892672 hartree
pointgroup: C01 [X(C18H23Cl5O2)]
dipole: -0.6208172 -0.7763818 -0.5039727 debye
polarizability: 318.8775266|7.2748482|270.3986881|38.5030125|-19.2584339|178.0972646 unknown
InChI: InChI=1S/C18H23Cl5O2/c1-2-3-4-5-6-7-8-9-10-11-12(24)25-18-16(22)14(20)13(19)15(21)17(18)23/h2-11H2,1H3
charge 0 multiplicity 1
48 atoms
Cl 5.172194 -2.406633 0.758486
Cl 2.135504 1.451297 -1.743532
Cl 4.321684 3.715695 -0.972426
Cl 7.395782 -0.186054 1.551327
Cl 6.955345 2.879929 0.677916
O  2.902588 -1.310442 -0.85963
O  1.585782 -1.002997 1.064828
C  -5.197904 -0.906586 0.292039
C  -3.76537 -0.728491 -0.259403
C  -6.154085 0.240384 -0.106233
C  -2.812143 -1.878844 0.135782
C  -7.589257 0.057161 0.437114
C  -1.383199 -1.70485 -0.425116
C  -8.547709 1.20125 0.035855
C  -0.443518 -2.866057 -0.027925
C  -9.984328 1.013876 0.575383
C  0.977686 -2.735886 -0.615049
C  -10.93579 2.160003 0.168551
C  1.774001 -1.60882 0.002626
C  3.812799 -0.322036 -0.445173
C  4.966532 -0.68567 0.284231
C  3.618746 1.02496 -0.823597
C  4.575061 2.006469 -0.482569
C  5.929205 0.288066 0.629261
C  5.733263 1.636773 0.24396
H  -5.157865 -0.982354 1.398918
H  -5.612908 -1.870675 -0.070299
H  -3.348491 0.233436 0.105101
H  -3.806671 -0.649909 -1.366175
H  -5.743044 1.204072 0.261025
H  -6.189363 0.320073 -1.213147
H  -3.233604 -2.842135 -0.221513
H  -2.763983 -1.950494 1.242317
H  -7.554926 -0.020362 1.544187
H  -7.998898 -0.907918 0.071263
H  -0.962256 -0.747499 -0.059005
H  -1.430936 -1.631251 -1.531962
H  -8.141897 2.166868 0.404257
H  -8.581097 1.281319 -1.071145
H  -0.378952 -2.925127 1.075589
H  -0.874888 -3.824461 -0.377681
H  -10.387869 0.048271 0.207337
H  -9.949967 0.934409 1.681253
H  1.56084 -3.663856 -0.444284
H  0.955735 -2.588529 -1.710282
H  -11.956046 2.001657 0.564221
H  -10.571409 3.131915 0.551952
H  -11.008874 2.241556 -0.932632
