program: Gaussian 09
title: 000062516
version: EM64L-G09RevD.01
frameworkgroup: C1[X(C23H29NO3)]
method: RPBEPBE
basis: SDD
operation: Freq
keyword: #p
keyword: freq=noraman
keyword: PBEPBE/SDD
title: #p freq=noraman PBEPBE/SDD
converged: YES YES NO NO
title: Mulliken charges:
elementType: O O O N C C C C C C C C C C C C C C C C C C C C C C C H H H H H H H H H H H H H H H H H H H H H H H H H H H H H
charge: -0.266805 -0.238986 -0.271960 -0.070466 0.105771 -0.474848 -0.516937 -0.394505 -0.390495 0.430139 0.202578 -0.352436 -0.389806 -0.387078 -0.258469 -0.253926 -0.251596 -0.245008 -0.219560 -0.401354 -0.675766 0.478763 -0.401207 -0.379135 -0.226757 -0.227060 -0.234186 0.217887 0.225040 0.224302 0.223423 0.211727 0.195909 0.205865 0.201438 0.194643 0.220489 0.237219 0.242256 0.199748 0.184083 0.224601 0.226092 0.229150 0.228837 0.227105 0.189393 0.187237 0.227718 0.232553 0.211789 0.231383 0.232781 0.225505 0.225083 0.227839
chargesum: 0.00000
title: Mulliken charges with hydrogens summed into heavy atoms:
elementType: O O O N C C C C C C C C C C C C C C C C C C C C C C C
charge: -0.266805 -0.238986 -0.271960 -0.070466 0.105771 -0.031921 -0.069213 0.013131 0.016808 0.430139 0.202578 0.062696 -0.152587 -0.144821 0.125363 -0.029325 -0.025504 -0.015857 0.236382 -0.024725 -0.003705 0.478763 -0.169824 -0.146354 -0.001252 -0.001978 -0.006347
polarizability: 3.05825890e+02 -6.17644844e+00 2.38595107e+02 -6.31441443e+00 -1.72527065e+01 2.33179439e+02
1716.lowfreq: -16.6425 -11.1106 -6.8537 -0.0009 -0.0003 0.0005 2.3384 5.7660 13.8819
frequency: -15.7328 -5.4166 12.2908 23.0490 29.8188 33.5796 54.0177 62.5388 64.5084 80.6727 87.8764 100.1225 108.8578 147.6833 158.8251 166.4318 195.3290 204.5292 236.1865 256.2633 264.8184 278.4984 293.6200 329.2467 332.6274 346.9218 368.4221 378.1516 387.6458 402.7016 402.9162 422.0577 467.2114 479.0644 487.6795 504.7816 523.5260 577.5193 601.5194 616.7675 617.1197 671.6331 695.8487 700.7827 705.5437 747.1420 751.8471 769.0352 779.8609 799.1708 806.0425 811.2608 818.8363 824.2925 848.1621 852.3290 876.4402 900.0178 914.7557 936.0479 946.9607 952.8942 973.5173 973.8649 975.0069 990.9544 991.1536 993.9494 995.1880 1002.2848 1019.1554 1020.8691 1024.0457 1027.9714 1028.6893 1054.1819 1078.3742 1082.1483 1086.0947 1088.7795 1100.5663 1112.1502 1126.7192 1133.8502 1135.3304 1161.4838 1165.7320 1171.7518 1173.1197 1175.2998 1185.2809 1191.3050 1192.1652 1199.2367 1210.2967 1225.0488 1247.8174 1254.3209 1275.5071 1290.8933 1295.8463 1310.8030 1317.5864 1323.4679 1334.8063 1343.5074 1353.0607 1355.5506 1363.9767 1375.8962 1384.6937 1386.6538 1399.8508 1408.3602 1433.1313 1439.0953 1458.3312 1463.2779 1464.1853 1471.2204 1472.9805 1473.7518 1477.3655 1483.0336 1484.9354 1486.4040 1486.6016 1490.1074 1588.6566 1596.8404 1606.0526 1616.8539 1617.9149 2852.9399 2860.0557 2888.9377 2918.1151 2927.2714 2969.1640 2982.2461 2994.7731 3008.8424 3009.3932 3016.2948 3030.4316 3035.3901 3047.3639 3067.8395 3075.8342 3085.7222 3091.4773 3106.6860 3120.2012 3122.5418 3123.1133 3130.8886 3135.2410 3145.2842 3147.0630 3156.0887 3163.4753 3167.2391
redmass: 3.6651 3.7538 4.9543 3.8255 3.5956 4.2944 4.9602 2.6884 7.6131 4.5298 2.2973 3.1042 3.7596 3.1257 2.9316 5.1505 3.5545 3.3615 3.0905 1.7372 2.6571 4.6124 2.8285 2.6789 3.2033 2.6897 3.1637 2.5613 2.7078 2.7946 2.7659 4.0634 3.6241 3.1398 3.9928 3.2326 3.6099 2.6652 4.2076 6.3753 6.3437 3.9662 3.9053 1.7984 1.9089 3.3786 2.3869 2.9337 2.7067 1.1048 1.5952 1.5026 2.1357 3.2959 1.2534 1.2474 3.0154 2.6027 1.5069 2.1736 2.1920 2.8119 1.5412 1.4475 1.3962 4.5060 5.2067 1.4298 1.3772 2.7849 2.7854 2.2667 2.5691 2.5176 2.8014 2.4241 2.0569 2.3551 1.7485 1.6008 2.4262 2.2454 2.4569 3.0582 1.4950 1.6780 3.0316 1.0580 1.2368 2.0207 1.1114 1.1035 1.1601 1.1178 1.8172 2.5134 1.1374 1.3468 1.2750 1.4031 1.4918 1.2935 1.3528 1.2769 1.3553 1.3247 1.3946 1.3630 1.3593 6.8152 1.5290 5.7766 1.2646 1.4775 2.2002 2.1822 1.0921 1.0412 1.0818 1.1103 1.1304 1.1026 1.1154 1.1068 1.7303 2.3385 1.0687 1.0964 5.8966 6.1654 6.6224 6.2383 9.8632 1.0715 1.0703 1.0699 1.0562 1.0564 1.1056 1.1023 1.0358 1.0606 1.0628 1.0678 1.0844 1.0855 1.0911 1.1066 1.0986 1.0992 1.0986 1.1026 1.0847 1.0845 1.0879 1.0880 1.0921 1.0928 1.0965 1.0953 1.1017 1.0994
irintensity: 0.1458 0.1099 0.1259 0.4616 0.3066 0.4465 0.2156 0.1782 0.6075 0.4797 1.5489 2.6519 5.0024 2.7079 0.0749 0.2577 6.3282 1.1312 1.4047 0.9546 2.6109 1.8389 0.2319 1.0797 4.4041 8.5469 9.8158 7.7067 1.0943 0.0033 0.0122 1.8857 5.4590 0.8012 0.9324 3.4811 7.2638 5.8461 7.6915 0.1393 0.1180 12.0267 7.4500 50.8535 62.7540 24.3565 50.7189 12.6987 14.4508 3.8349 2.8588 2.1961 2.8140 5.9350 0.3014 0.0219 4.3375 11.8289 4.5175 3.1464 8.3719 17.2783 2.1212 0.2562 0.0075 0.6067 0.3288 2.1668 1.3220 31.6437 118.9243 39.2742 160.0117 13.9356 84.1643 37.4890 26.6245 21.8845 0.4914 14.6806 31.6948 3.8020 29.7981 2.1995 5.0840 1.6478 151.8028 0.6791 39.4860 115.8583 0.2751 9.2266 3.5988 3.9833 8.8527 9.9643 0.0749 9.2797 6.1127 10.0284 18.1667 24.2502 2.5486 0.2704 0.7751 3.1865 4.7639 3.7292 5.5549 0.3044 10.3182 1.6017 24.0772 3.3103 6.8873 8.4799 13.9362 13.1472 0.5085 7.8763 28.2956 7.8814 16.4289 2.5087 11.3672 8.0908 11.6074 3.8990 1.8579 0.6796 47.5108 0.2002 124.6251 30.5383 92.9119 88.5305 31.9574 114.0047 53.4279 36.7283 20.5055 28.4157 2.7584 16.7080 52.2355 43.4618 43.9969 7.3130 21.7911 28.4348 31.9319 42.6082 4.5435 1.1456 1.4523 5.1631 18.0114 24.0847 45.5961 36.7247 22.3394 11.3476
temp: 298.150 k
press: 1.00000 atm
elementType: 8 8 8 7 6 6 6 6 6 6 6 6 6 6 6 6 6 6 6 6 6 6 6 6 6 6 6 1 1 1 1 1 1 1 1 1 1 1 1 1 1 1 1 1 1 1 1 1 1 1 1 1 1 1 1 1
symmnumber: 1
zpe: 1233906.9 jmol-1
zpe.correction: 0.469970 hartree
zpe.thermalcorrener: 0.494756 hartree
zpe.thermalcorrenthalpy: 0.495700 hartree
zpe.thermalcorrgfe: 0.412169 hartree
zpe.sumelectzpe: -1172.222820 hartree
zpe.sumelectthermal: -1172.198034 hartree
zpe.sumelectthermalent: -1172.197090 hartree
zpe.sumelectthermalfe: -1172.280621 hartree
dipole: 0.5948 -0.6145 -2.5463
dipole: 2.6861
quadrupole: -148.9015 -153.0274 -155.9680
quadrupole: 1.6983 -9.2887 1.7287
quadrupole: 3.7308 -0.3951 -3.3357 1.6983 -9.2887 1.7287
hfenergy: -1172.6927902 hartree
pointgroup: C01 [X(C23H29N1O3)]
dipole: 0.2232188 0.1258935 1.0252451 debye
polarizability: 305.589635|6.078883|242.5899157|7.8480739|-16.0495845|229.4208855 unknown
InChI: InChI=1S/C23H29NO3/c1-2-27-22(25)23(21-11-7-4-8-12-21)13-15-24(16-14-23)17-18-26-19-20-9-5-3-6-10-20/h3-12H,2,13-19H2,1H3
charge 0 multiplicity 1
56 atoms
O  4.673094 1.587713 0.7838
O  4.721918 1.66653 -1.53874
O  -3.811939 0.31419 -0.044386
N  -0.108594 0.478088 -0.571728
C  2.880082 0.4381 -0.392735
C  2.091422 0.597938 -1.729682
C  1.956691 0.960498 0.747879
C  0.718825 -0.092931 -1.666598
C  0.567389 0.289655 0.737166
C  3.390233 -1.017982 -0.184119
C  4.162599 1.29563 -0.480143
C  -1.495013 -0.048765 -0.580908
C  3.276725 -1.698502 1.054961
C  4.057858 -1.681349 -1.24897
C  -2.47542 0.90542 0.115908
C  3.789441 -3.005207 1.217983
C  4.573802 -2.985364 -1.089182
C  4.437035 -3.65876 0.146111
C  5.973548 2.327322 0.81318
C  -4.860204 1.150654 0.577515
C  6.360512 2.475796 2.280761
C  -6.200925 0.488507 0.351077
C  -7.015485 0.866537 -0.744794
C  -6.65402 -0.53447 1.221426
C  -8.259196 0.234479 -0.970206
C  -7.895627 -1.170458 0.999773
C  -8.702417 -0.785833 -0.097019
H  2.672787 0.207977 -2.581076
H  1.937339 1.67685 -1.915402
H  1.810431 2.046273 0.595564
H  2.43601 0.840832 1.733848
H  0.18789 0.069946 -2.622602
H  0.856648 -1.198071 -1.545329
H  0.658299 -0.799581 0.980207
H  -0.051148 0.748303 1.530023
H  -1.572717 -1.060118 -0.111821
H  -1.824654 -0.154048 -1.630443
H  2.794071 -1.214529 1.908934
H  4.195932 -1.169719 -2.207789
H  -2.425727 1.907485 -0.361931
H  -2.240608 1.022564 1.197706
H  3.683747 -3.511008 2.184623
H  5.085996 -3.472136 -1.926893
H  4.833898 -4.672209 0.272737
H  6.713328 1.745444 0.234153
H  5.83017 3.300441 0.309409
H  -4.839292 2.165901 0.123407
H  -4.645608 1.255118 1.664745
H  5.595477 3.045674 2.835553
H  6.474118 1.487644 2.758268
H  7.322194 3.01478 2.361552
H  -6.670019 1.652912 -1.426967
H  -6.026363 -0.837218 2.068314
H  -8.880047 0.535692 -1.821497
H  -8.234721 -1.961045 1.67865
H  -9.667463 -1.276092 -0.268674
