program: Gaussian 09
title: 000062506
version: EM64L-G09RevD.01
frameworkgroup: C1[X(C19H12Cl4N2O5S)]
method: RPBEPBE
basis: SDD
operation: Freq
keyword: #p
keyword: freq=noraman
keyword: PBEPBE/SDD
title: #p freq=noraman PBEPBE/SDD
converged: YES YES NO NO
title: Mulliken charges:
elementType: Cl Cl Cl Cl S O O O O O N N C C C C C C C C C C C C C C C C C C C H H H H H H H H H H H H
charge: -0.006268 -0.042833 -0.020096 -0.015860 1.025895 -0.323780 -0.527921 -0.469616 -0.600317 -0.284988 -0.514984 -0.534808 0.454374 -0.227817 0.156434 0.311409 -0.283299 -0.211791 -0.330216 -0.244532 -0.182786 -0.120268 -0.258158 -0.118581 0.246801 0.517979 -0.462180 -0.341628 -0.023630 -0.181389 -0.123643 0.287131 0.317957 0.271007 0.336879 0.385121 0.269807 0.263308 0.376709 0.265437 0.313493 0.255894 0.395756
chargesum: 0.00000
title: Mulliken charges with hydrogens summed into heavy atoms:
elementType: Cl Cl Cl Cl S O O O O O N N C C C C C C C C C C C C C C C C C C C
charge: -0.006268 -0.042833 -0.020096 -0.015860 1.025895 -0.323780 -0.132165 -0.469616 -0.600317 -0.284988 -0.129864 -0.158099 0.454374 -0.227817 0.156434 0.311409 0.003832 0.106167 -0.059209 0.092347 0.087021 -0.120268 0.005150 -0.118581 0.246801 0.517979 -0.196744 -0.028135 -0.023630 0.074505 -0.123643
polarizability: 4.44514173e+02 -2.55152368e+01 4.00349028e+02 1.20653505e+01 -8.19900943e+00 1.73206361e+02
1716.lowfreq: -3.7609 -1.5676 -0.0018 -0.0014 -0.0005 2.0302 11.0896 18.4656 29.9296
frequency: 11.0417 18.4611 29.9191 31.3894 36.6487 64.9798 69.3126 76.8594 90.1426 103.7923 109.0250 117.5006 125.4677 129.4286 130.8926 154.8050 163.0233 178.3462 193.2539 195.9383 204.7786 225.7295 231.1652 237.9033 258.9434 276.1167 299.2456 304.4979 312.5426 326.8283 329.9526 341.8830 365.3437 381.2231 382.2508 421.6962 432.3166 439.9530 441.4013 446.6117 454.1224 476.1679 519.6600 535.6957 562.4847 573.2441 574.0372 583.0928 632.3355 635.8730 653.2205 672.5130 690.1799 692.2892 697.4064 701.3088 712.7796 729.3800 763.4263 784.1846 796.3921 827.1701 830.4959 833.9885 845.0459 859.0347 870.5005 882.2697 894.8011 910.6689 913.9783 927.9229 954.6044 963.5370 974.1139 994.7397 998.0566 1014.0502 1069.1632 1072.3874 1083.0201 1099.8362 1122.2688 1140.8733 1145.1591 1157.4890 1197.1558 1223.1472 1243.8289 1246.2088 1253.9857 1276.9283 1303.0478 1349.0976 1352.0324 1376.7911 1396.4153 1399.9248 1421.5806 1448.2720 1464.9930 1473.4123 1525.5731 1533.7104 1559.2416 1586.5843 1591.6688 1598.5318 1605.5346 1611.4032 1676.8647 3148.2987 3156.3994 3163.4832 3164.9105 3167.7141 3184.2940 3186.1012 3195.1759 3201.7097 3321.7890 3423.0098 3468.4816
redmass: 13.9881 11.2747 11.3337 14.4466 12.8027 11.1811 9.3218 7.7628 6.7332 8.2742 7.4477 12.1294 9.5665 7.7943 6.2538 1.8239 9.2011 18.3601 6.2373 11.3446 3.2801 7.0688 6.2285 11.0386 8.7062 9.8698 8.8620 10.4303 7.8128 6.2144 10.1196 8.1870 10.7398 12.5632 7.1093 6.8547 6.3696 7.9037 3.1419 3.5958 4.4740 6.8410 7.4031 5.1950 6.5516 4.7998 9.5234 5.4114 7.7312 6.3926 7.2317 7.6722 3.2929 8.0592 3.4991 4.0569 2.5894 2.1977 6.2766 6.7612 1.4476 1.4524 9.1616 1.3280 6.5576 1.3803 6.6549 1.3592 1.3743 1.5979 3.2800 1.3364 12.4608 1.3554 1.3110 5.7700 4.6258 5.9420 2.1294 1.1660 2.6366 2.2744 2.2415 1.3939 1.3294 1.6705 3.1810 3.2058 1.4375 1.4770 1.3717 2.2910 2.7013 4.3362 3.9684 6.4447 5.1999 5.5527 3.9315 2.6043 2.9519 3.1139 2.5560 3.3147 7.9614 3.4231 4.4846 7.4945 6.8959 6.9162 2.2916 1.0925 1.0902 1.0931 1.0910 1.0890 1.0966 1.0965 1.0934 1.0950 1.0799 1.0785 1.0662
irintensity: 0.0612 0.0116 0.7304 0.1365 0.2860 1.3722 1.3100 2.2921 0.2934 2.1157 2.5720 2.9168 1.9428 1.5284 0.1443 79.8057 3.2884 0.6986 1.2875 1.4110 22.5110 4.2834 0.0890 0.9476 7.8480 7.4810 27.9473 14.1295 7.4767 2.2833 5.1905 4.6813 2.1046 9.4320 4.9091 27.7858 7.9007 52.2396 7.5873 6.2588 26.5872 13.6789 26.1500 55.0074 2.5269 16.2630 65.2051 3.0267 20.7471 14.6695 11.3887 23.7054 3.5285 14.3795 4.5742 1.8869 2.4369 5.5322 22.6181 1.7644 41.7603 13.4277 75.3997 40.9744 63.8024 15.9647 41.6557 195.7615 17.7574 17.8248 28.7858 10.4959 151.4426 0.6342 3.4596 20.9093 24.1551 18.6372 13.2087 70.8738 71.7122 43.9797 88.2310 11.8614 2.6617 41.0929 421.9910 202.5486 43.2678 108.1039 18.4567 153.4948 16.0941 27.4076 172.4927 183.4044 6.3631 6.9431 177.3919 289.7392 404.2949 62.4055 807.5790 169.0900 8.0584 340.3675 54.1117 23.5411 155.8960 82.3633 135.7726 3.7908 4.0799 14.3053 1.7572 0.2704 0.2902 0.2452 19.1205 8.9999 419.0445 261.3005 68.0139
temp: 298.150 k
press: 1.00000 atm
elementType: 17 17 17 17 16 8 8 8 8 8 7 7 6 6 6 6 6 6 6 6 6 6 6 6 6 6 6 6 6 6 6 1 1 1 1 1 1 1 1 1 1 1 1
symmnumber: 1
zpe: 723817.8 jmol-1
zpe.correction: 0.275688 hartree
zpe.thermalcorrener: 0.305409 hartree
zpe.thermalcorrenthalpy: 0.306353 hartree
zpe.thermalcorrgfe: 0.211603 hartree
zpe.sumelectzpe: -3452.793308 hartree
zpe.sumelectthermal: -3452.763587 hartree
zpe.sumelectthermalent: -3452.762643 hartree
zpe.sumelectthermalfe: -3452.857392 hartree
dipole: -8.3084 -0.9001 1.0185
dipole: 8.4188
quadrupole: -219.0193 -236.8200 -209.0501
quadrupole: 3.9008 5.9090 -0.7294
quadrupole: 2.6105 -15.1902 12.5797 3.9008 5.9090 -0.7294
hfenergy: -3453.0689958 hartree
pointgroup: C01 [X(C19H12Cl4N2O5S1)]
dipole: 3.2811029 -0.3485882 -0.289161 debye
polarizability: 418.5794367|-17.1289253|395.7921221|-60.9730415|64.128918|203.6980028 unknown
InChI: InChI=1S/C19H12Cl4N2O5S/c20-10-1-5-16(30-17-6-2-11(21)8-18(17)31(27,28)29)15(7-10)25-19(26)24-12-3-4-13(22)14(23)9-12/h1-9,24-25,27H
charge 0 multiplicity 1
43 atoms
Cl 5.440454 3.688495 -2.475745
Cl 0.504765 -6.042257 -1.876411
Cl -5.307893 3.87778 2.039613
Cl -7.869681 2.055468 1.031421
S  1.832437 2.027489 1.399417
O  2.331602 -0.712297 0.23171
O  2.699173 1.143495 2.748828
O  1.89654 3.616735 1.644099
O  0.357995 1.360858 1.203267
O  -2.401448 -2.030917 -0.591385
N  -0.275979 -1.148718 -0.049059
N  -2.164882 0.091869 0.433738
C  3.035264 0.249763 -0.489337
C  2.989995 1.576924 0.00057
C  1.967335 -1.982388 -0.330507
C  0.560545 -2.197598 -0.449678
C  3.810344 0.007845 -1.649365
C  3.704508 2.64367 -0.567479
C  2.910727 -2.982546 -0.607942
C  0.118968 -3.457992 -0.937947
C  4.53094 1.059509 -2.250948
C  4.486701 2.358446 -1.701427
C  2.468912 -4.237051 -1.08705
C  1.08187 -4.43251 -1.249902
C  -1.682694 -1.106827 -0.109193
C  -3.515497 0.500924 0.546718
C  -3.752873 1.774075 1.132617
C  -4.617848 -0.285624 0.113256
C  -5.067663 2.247973 1.282403
C  -5.926896 0.208851 0.271344
C  -6.164011 1.47115 0.853341
H  3.841287 -0.994933 -2.082267
H  3.629984 3.651594 -0.147143
H  3.975058 -2.801893 -0.429342
H  -0.950932 -3.638988 -1.052795
H  0.199921 -0.338249 0.381474
H  5.12866 0.866677 -3.146339
H  3.180232 -5.03412 -1.314752
H  -1.46346 0.752367 0.794467
H  -2.918181 2.397517 1.470402
H  -4.43969 -1.262964 -0.336766
H  -6.77908 -0.391755 -0.060134
H  2.109391 1.154852 3.55953
