program: Gaussian 09
title: 000062504
version: EM64L-G09RevD.01
frameworkgroup: C1[X(C21H25NO3)]
method: RPBEPBE
basis: SDD
operation: Freq
keyword: #p
keyword: freq=noraman
keyword: PBEPBE/SDD
title: #p freq=noraman PBEPBE/SDD
converged: YES YES NO NO
title: Mulliken charges:
elementType: O O O N C C C C C C C C C C C C C C C C C C C C C H H H H H H H H H H H H H H H H H H H H H H H H H
charge: -0.327592 -0.477262 -0.221327 -0.076134 0.039243 -0.462291 -0.426015 -0.402166 -0.348960 -0.296674 -0.156822 0.210729 -0.700104 0.394363 0.399367 -0.404661 -0.392152 -0.377640 -0.340360 -0.245798 -0.223652 -0.224674 -0.239738 -0.241853 -0.241716 0.256787 0.203623 0.234130 0.185181 0.247264 0.215542 0.203700 0.215053 0.170440 0.178374 0.211284 0.230982 0.212787 0.215368 0.373404 0.270594 0.283362 0.277549 0.245623 0.225967 0.223203 0.225908 0.223957 0.228205 0.225603
chargesum: 0.00000
title: Mulliken charges with hydrogens summed into heavy atoms:
elementType: O O O N C C C C C C C C C C C C C C C C C C C C C
charge: -0.327592 -0.103858 -0.221327 -0.076134 0.296030 -0.024537 0.006430 0.017076 0.036533 0.092985 -0.156822 0.210729 -0.040966 0.394363 0.399367 -0.134067 -0.108790 -0.100091 -0.094737 -0.019831 -0.000449 0.001233 -0.015781 -0.013649 -0.016113
polarizability: 2.53536540e+02 1.53479625e+01 2.47353307e+02 -1.23321670e+00 1.22143332e+01 2.08500410e+02
1716.lowfreq: -12.0081 -5.5281 -4.9053 -0.0005 0.0004 0.0008 2.6626 12.1021 18.4212
frequency: -5.2247 11.9276 18.2717 36.2485 43.7688 52.9397 60.1684 74.9249 111.6859 118.0069 148.2411 178.4392 194.2912 210.7117 219.8889 233.8531 247.1082 269.8982 280.0569 292.2425 323.6237 329.0279 355.2979 368.3836 393.6052 401.4548 406.4691 414.1466 439.5100 446.8978 476.4307 487.3188 506.3578 550.9630 567.7848 605.3548 615.2992 616.3339 661.3875 692.3548 701.7815 709.2455 737.0356 751.0372 759.9884 780.8344 801.4180 833.6744 851.3659 862.9733 870.0718 877.8722 896.7465 909.0043 930.2279 938.9819 949.5440 953.9808 964.3229 979.2043 986.8776 989.5486 991.0162 993.8509 997.1480 999.6635 1015.9245 1028.6075 1030.5257 1049.9195 1080.6144 1081.6971 1090.1730 1093.8247 1124.0383 1129.1228 1137.5799 1147.7448 1150.4665 1159.5305 1168.7563 1171.7135 1175.9517 1190.9290 1195.2863 1199.6764 1228.2239 1264.3303 1271.0395 1279.8484 1294.9768 1310.5756 1318.8049 1319.4922 1335.7442 1341.6099 1344.4341 1356.8429 1362.9741 1378.2498 1382.4387 1388.4024 1396.1142 1431.2584 1434.9734 1458.2272 1460.5022 1469.9124 1472.1057 1475.7515 1475.8809 1478.8256 1478.8859 1491.2840 1589.0902 1592.9783 1605.9735 1610.0181 1640.8632 2824.1135 2839.6288 2853.8836 2986.8921 2987.7078 2998.4987 3017.0192 3041.2922 3048.9863 3056.1650 3058.6169 3070.3152 3080.8730 3093.0248 3122.6441 3122.9013 3132.7942 3135.3737 3145.3141 3152.9047 3158.4515 3168.7723 3171.9477 3182.0010 3521.5540
redmass: 3.7987 4.4747 4.4090 3.9805 4.0611 2.9275 4.3402 4.0686 4.3221 2.2024 4.3336 4.8960 3.9527 3.0115 3.8274 1.3977 4.2749 3.8078 2.9719 3.1706 4.0880 2.7815 3.1506 2.3266 2.9412 2.8497 3.0273 2.2641 2.9692 3.5006 3.4555 2.5521 2.9751 3.6792 4.7133 6.2285 6.3952 6.4163 5.8453 6.6926 1.9096 1.9113 3.1497 2.4696 1.7622 2.7059 1.1521 3.0156 1.2562 1.2432 1.8834 1.9805 3.5414 2.1548 1.8576 1.6394 2.0299 2.7813 2.2148 1.3948 1.7079 3.6790 4.9585 1.8323 1.3393 1.3252 5.5431 2.1711 2.2174 2.0482 1.6051 2.1198 2.0701 1.9646 2.5899 2.0535 2.2152 1.5220 2.6395 2.4734 1.2889 1.0835 1.7799 1.2858 1.1462 2.2041 1.4928 1.2356 1.2614 1.2024 1.3160 1.3578 1.3437 1.3003 1.4082 1.4159 1.4027 1.4562 1.4784 8.2049 9.0171 1.2524 1.4053 2.1938 2.2348 1.0869 1.0792 1.0850 1.0534 1.0791 2.1522 1.4430 1.4524 1.0722 6.1856 6.3340 6.0043 6.0451 11.6544 1.0716 1.0704 1.0699 1.0623 1.0360 1.0612 1.0879 1.0856 1.0916 1.0876 1.0996 1.1005 1.0982 1.1005 1.0849 1.0847 1.0885 1.0898 1.0935 1.0954 1.0976 1.0962 1.0972 1.0948 1.0647
irintensity: 0.4603 0.2184 0.3306 0.6160 0.5289 0.7285 0.3152 0.5675 0.4694 2.2282 0.4430 0.3256 4.5028 1.7308 3.6291 1.3710 3.0008 1.3622 4.5114 3.0556 1.4115 71.8122 6.5756 23.2349 4.4872 1.8932 1.6870 45.6039 6.3067 16.5729 5.3610 1.6836 6.2760 8.2106 6.8777 22.3126 0.0135 0.3962 21.7708 6.6999 46.8253 54.1951 33.0218 9.2792 41.4031 27.2271 4.6323 22.5135 0.2520 0.0491 6.5186 8.8533 3.8924 12.1076 38.3418 14.2157 9.4523 94.8137 46.1272 0.3982 0.8379 2.0708 0.3544 37.8506 2.7449 0.1258 45.3076 17.2148 7.6916 7.2478 11.1112 5.7748 118.4971 23.7464 206.7282 45.1115 195.9427 5.2343 53.3657 19.2331 5.8624 1.1330 9.6535 2.2546 0.7914 20.5500 3.7470 5.2615 6.5951 3.2861 13.0291 1.8574 0.7146 6.0570 58.3409 6.4747 10.5887 9.0252 2.3547 0.0639 0.8147 10.3493 17.6284 4.0084 30.4272 12.7476 5.2781 4.2024 8.4899 9.1374 29.3298 11.8106 9.1638 11.6370 1.0643 0.0949 9.2040 2.2713 98.0783 66.4986 36.0353 183.9058 26.6404 25.4254 33.6731 15.1492 17.8802 23.6255 35.5035 20.1477 49.7386 49.2209 35.7417 0.4864 0.2281 10.2281 18.9796 18.2167 40.5907 23.6928 10.5905 13.9131 7.5491 69.2653
temp: 298.150 k
press: 1.00000 atm
elementType: 8 8 8 7 6 6 6 6 6 6 6 6 6 6 6 6 6 6 6 6 6 6 6 6 6 1 1 1 1 1 1 1 1 1 1 1 1 1 1 1 1 1 1 1 1 1 1 1 1 1
symmnumber: 1
zpe: 1086283.9 jmol-1
zpe.correction: 0.413744 hartree
zpe.thermalcorrener: 0.436474 hartree
zpe.thermalcorrenthalpy: 0.437419 hartree
zpe.thermalcorrgfe: 0.359413 hartree
zpe.sumelectzpe: -1093.796887 hartree
zpe.sumelectthermal: -1093.774156 hartree
zpe.sumelectthermalent: -1093.773212 hartree
zpe.sumelectthermalfe: -1093.851217 hartree
dipole: 3.3153 0.9212 -1.1729
dipole: 3.6353
quadrupole: -136.5942 -138.1615 -146.5223
quadrupole: -0.1654 -5.5332 4.7375
quadrupole: 3.8318 2.2645 -6.0963 -0.1654 -5.5332 4.7375
hfenergy: -1094.2106306 hartree
pointgroup: C01 [X(C21H25N1O3)]
dipole: -1.2930415 0.6108231 0.0227768 debye
polarizability: 253.7257184|-11.4230982|211.2509781|10.9899729|-15.2505762|244.4135602 unknown
InChI: InChI=1S/C21H25NO3/c1-2-22-15-9-14-19(16-22)25-20(23)21(24,17-10-5-3-6-11-17)18-12-7-4-8-13-18/h3-8,10-13,19,24H,2,9,14-16H2,1H3
charge 0 multiplicity 1
50 atoms
O  -0.885786 0.148583 0.942969
O  1.410306 1.170274 1.457237
O  -0.120392 -1.510023 -0.508177
N  -4.44778 -0.280408 -0.244157
C  -2.278679 -0.421202 0.923136
C  -2.922398 -0.061659 2.264323
C  -3.044505 0.197746 -0.261113
C  -4.414345 -0.473833 2.236413
C  -5.132107 0.125342 1.008992
C  -5.173587 0.111892 -1.481415
C  1.443995 0.275073 0.298149
C  0.093465 -0.493989 0.184025
C  -6.512482 -0.625754 -1.66507
C  1.653203 1.106582 -1.000144
C  2.595766 -0.730899 0.527299
C  1.19552 0.683571 -2.27327
C  3.209675 -0.817318 1.799823
C  2.371203 2.323862 -0.892536
C  3.033114 -1.583637 -0.515228
C  1.45134 1.471204 -3.419251
C  4.25234 -1.744765 2.024799
C  2.62859 3.105353 -2.039282
C  4.070063 -2.513787 -0.285708
C  2.169105 2.683027 -3.30874
C  4.685389 -2.59798 0.984898
H  -2.196505 -1.513511 0.78078
H  -2.838831 1.032601 2.419186
H  -2.387159 -0.558569 3.093105
H  -2.973203 1.314646 -0.186825
H  -2.571729 -0.113924 -1.209227
H  -4.498391 -1.57619 2.192158
H  -4.913656 -0.135387 3.163321
H  -6.173929 -0.236388 0.978963
H  -5.166486 1.244023 1.106103
H  -5.346277 1.219127 -1.518537
H  -4.513455 -0.135574 -2.334346
H  -6.358932 -1.716622 -1.591064
H  -7.265031 -0.328762 -0.913037
H  -6.934955 -0.397547 -2.660716
H  0.466591 1.453804 1.58395
H  0.638435 -0.253949 -2.377407
H  2.868758 -0.148412 2.593632
H  2.713262 2.644673 0.095783
H  2.569835 -1.525954 -1.504214
H  1.089338 1.134952 -4.397562
H  4.724492 -1.799778 3.012475
H  3.187813 4.042951 -1.942289
H  4.398234 -3.170313 -1.099381
H  2.36762 3.290853 -4.198701
H  5.492848 -3.318006 1.16048
