program: Gaussian 09
title: 000073387
version: EM64L-G09RevD.01
frameworkgroup: C1[X(C16H12O7)]
method: RPBEPBE
basis: SDD
operation: Freq
keyword: #pfreq=noraman
keyword: PBEPBE/SDD
title: #p freq=noraman PBEPBE/SDD
converged: YES YES NO NO
title: Mulliken charges:
elementType: O O O O O O O C C C C C C C C C C C C C C C C H H H H H H H H H H H H
charge: -0.283868 -0.422075 -0.325649 -0.419747 -0.401707 -0.382448 -0.262338 0.088296 0.439202 0.295710 0.242100 0.131343 -0.370887 -0.614768 -0.580183 0.201288 -0.569066 0.277109 0.251509 -0.018380 -0.518032 0.199696 -0.520156 0.247122 0.301358 0.264830 0.277865 0.275831 0.372320 0.356328 0.366072 0.388061 0.252614 0.226910 0.233745
chargesum: 0.00000
title: Mulliken charges with hydrogens summed into heavy atoms:
elementType: O O O O O O O C C C C C C C C C C C C C C C C
charge: -0.283868 -0.049756 -0.325649 -0.063419 -0.035634 0.005613 -0.262338 0.088296 0.439202 0.295710 0.242100 0.131343 -0.123765 -0.313411 -0.315354 0.201288 -0.291201 0.277109 0.251509 -0.018380 -0.242201 0.199696 0.193112
polarizability: 4.74987138e+02 -2.49250371e+01 2.41023783e+02 -9.51866279e+00 5.91529550e+00 9.48045673e+01
1716.lowfreq: -7.3351 -4.6675 -3.5339 -0.0004 0.0004 0.0008 25.5066 35.7041 55.6982
frequency: 25.4814 35.6918 55.6968 71.9025 81.6508 122.8752 146.5098 164.7222 180.3646 187.7277 200.3054 205.3395 226.7753 232.2304 242.8066 259.0168 268.8720 289.8212 323.2849 336.0382 355.5152 365.8071 370.1747 384.9645 407.8469 428.7191 455.3477 492.3785 500.1787 512.3661 516.1290 524.5210 539.0777 570.2252 582.0533 594.8080 604.4653 638.9718 656.3462 675.6358 680.8767 716.0791 733.3413 752.1343 830.0529 840.2014 845.4503 848.3672 866.9943 872.1336 886.2652 911.9057 931.9182 979.6668 1043.4397 1062.4174 1086.1807 1114.9441 1124.1163 1141.0704 1148.4387 1155.8845 1172.4875 1182.4133 1215.2690 1226.2238 1245.3863 1250.9907 1294.0855 1312.2451 1321.5466 1352.1158 1382.6315 1414.6341 1426.4901 1436.5944 1458.9573 1466.0468 1470.3854 1503.3027 1513.2849 1539.5860 1564.5492 1585.6673 1602.3511 1623.8359 1654.5651 2971.8735 3064.9114 3136.2885 3144.2357 3146.6048 3155.9004 3180.9276 3184.9490 3496.3840 3497.1875 3573.3331 3580.3681
redmass: 5.7896 7.2746 7.3736 4.3557 5.7674 6.6590 5.0178 3.9829 3.7947 2.9886 1.6491 6.5695 2.8868 3.9997 2.4547 4.0258 3.3135 5.9483 4.4365 5.9751 2.7577 3.9820 1.6533 6.0987 1.6823 2.5649 5.7806 5.9398 7.5553 1.1805 5.2174 6.1936 5.4434 4.7518 5.6359 5.9270 6.2507 6.6374 4.4299 5.9360 5.5468 3.3986 4.4910 6.0485 4.9100 1.4269 1.5126 4.5004 1.5392 1.5173 1.6848 5.9242 2.7734 7.3173 3.6333 4.0927 3.4776 1.2552 1.4187 1.7912 2.1223 1.8026 1.3871 2.8521 1.5624 1.6719 1.5685 1.6946 6.8454 2.1081 1.6404 5.6768 4.2102 5.3097 4.7856 1.5774 2.9387 1.0509 1.0884 4.3855 5.6962 7.4023 7.7254 6.7279 6.7496 5.8996 8.3455 1.0326 1.1047 1.1004 1.0917 1.0917 1.0914 1.0923 1.0932 1.0647 1.0654 1.0659 1.0662
irintensity: 0.4244 0.0719 3.2795 9.5011 0.5063 1.0521 1.7482 1.5501 1.2173 23.0849 4.2666 11.1014 20.4350 5.7925 43.1796 15.4009 1.9981 28.9561 32.8447 17.6754 34.8237 14.1920 53.1969 13.5222 79.9073 42.5151 7.8447 12.9045 11.1636 149.1939 27.9077 27.9098 12.7192 10.3372 25.5813 1.4287 0.8758 8.5349 2.8283 13.3990 14.0156 3.6857 2.3490 21.5755 5.7552 15.0194 21.9256 13.6972 14.3959 14.7734 60.6693 13.0878 23.1607 71.2417 179.4304 72.7840 22.9287 0.6503 318.0648 194.2846 66.0238 10.0247 200.4265 291.3935 2.1456 16.2241 26.7509 128.0288 5.9832 54.5542 22.4284 193.3238 223.1516 40.9223 44.7100 15.7593 60.0304 20.8165 125.0850 819.1231 22.8387 75.8269 179.1562 31.1631 60.0800 106.8546 61.3125 43.3679 37.7204 21.2825 6.7458 3.0813 0.3274 1.2505 0.3225 104.8310 146.6832 18.4796 53.7529
temp: 298.150 k
press: 1.00000 atm
elementType: 8 8 8 8 8 8 8 6 6 6 6 6 6 6 6 6 6 6 6 6 6 6 6 1 1 1 1 1 1 1 1 1 1 1 1
symmnumber: 1
zpe: 650488.2 jmol-1
zpe.correction: 0.247758 hartree
zpe.thermalcorrener: 0.268601 hartree
zpe.thermalcorrenthalpy: 0.269545 hartree
zpe.thermalcorrgfe: 0.198426 hartree
zpe.sumelectzpe: -1141.769809 hartree
zpe.sumelectthermal: -1141.748966 hartree
zpe.sumelectthermalent: -1141.748022 hartree
zpe.sumelectthermalfe: -1141.819141 hartree
dipole: 8.0148 -6.8235 -0.3341
dipole: 10.5313
quadrupole: -169.8312 -126.0633 -133.5092
quadrupole: 2.0682 8.3927 -8.3628
quadrupole: -26.6966 17.0713 9.6253 2.0682 8.3927 -8.3628
hfenergy: -1142.017567 hartree
pointgroup: C01 [X(C16H12O7)]
dipole: 3.1301106 -2.4089097 1.251738 debye
polarizability: 474.7243895|-23.4285841|212.7185259|14.0693053|-58.5660338|123.372573 unknown
InChI: InChI=1S/C16H12O7/c1-22-14-3-7(2-11(19)15(14)21)16-12(20)6-9-10(18)4-8(17)5-13(9)23-16/h2-6,18-21H,1H3
charge 0 multiplicity 1
35 atoms
O  -0.830209 0.706735 -0.320312
O  0.329692 -2.767565 0.373375
O  4.892132 -0.780157 1.203938
O  -4.817754 -2.073362 0.633803
O  3.64579 2.45374 -2.025706
O  5.532551 1.136853 -0.525689
O  -5.272239 2.473776 -0.835455
C  0.052593 -0.351296 -0.055299
C  1.464844 0.020753 -0.164122
C  -2.766263 -0.761166 0.131607
C  -2.240399 0.544795 -0.263263
C  -0.467507 -1.618584 0.219191
C  -1.877853 -1.818244 0.329369
C  2.455752 -0.642042 0.625799
C  1.8528 1.063514 -1.045473
C  -4.218338 -0.864117 0.238904
C  -3.030863 1.621374 -0.584827
C  3.800015 -0.252465 0.491199
C  3.206176 1.440627 -1.172789
C  4.199257 0.775036 -0.409943
C  -5.034136 0.197272 -0.086629
C  -4.493502 1.497462 -0.531272
C  4.627634 -1.817354 2.205172
H  -2.210442 -2.84144 0.534737
H  2.161507 -1.346993 1.408683
H  1.081059 1.575542 -1.630568
H  -2.599596 2.580455 -0.881283
H  -6.121011 0.101225 -0.00878
H  1.236534 -2.610527 -0.001786
H  -4.187559 -2.654403 1.127893
H  2.882948 2.869499 -2.49999
H  6.06334 0.575995 0.103011
H  5.610655 -2.076665 2.622979
H  4.172086 -2.710452 1.73677
H  3.969107 -1.432419 3.006256
