program: Gaussian 09
title: 000062493
version: EM64L-G09RevD.01
frameworkgroup: C1[X(C5H9ClO)]
method: RPBEPBE
basis: SDD
operation: Freq
keyword: #p
keyword: freq=noraman
keyword: PBEPBE/SDD
title: #p freq=noraman PBEPBE/SDD
converged: YES YES NO NO
title: Mulliken charges:
elementType: Cl O C C C C C H H H H H H H H H
charge: -0.122418 -0.084423 0.211071 -0.668225 -0.681023 -0.668370 -0.035657 0.225844 0.218543 0.242626 0.230853 0.213273 0.230865 0.242642 0.218495 0.225904
chargesum: 0.00000
title: Mulliken charges with hydrogens summed into heavy atoms:
elementType: Cl O C C C C C
charge: -0.122418 -0.084423 0.211071 0.018788 -0.006031 0.018670 -0.035657
polarizability: 7.64494247e+01 -6.56989525e+00 6.80255551e+01 1.54406704e-03 3.52669224e-04 5.31694187e+01
1716.lowfreq: -16.5302 -15.8753 -5.8286 -0.0014 0.0018 0.0027 48.7865 164.4491 206.1214
frequency: 48.5129 164.3922 206.1118 208.0125 247.4205 265.7724 296.2960 339.3943 358.7490 381.2452 449.1254 584.3953 648.2623 775.4968 888.0118 934.4630 935.0870 961.2764 1022.3438 1030.7542 1203.1238 1217.5232 1228.2550 1378.9650 1382.7067 1408.9597 1451.2333 1463.8000 1468.2984 1475.4089 1475.9373 1498.0471 1735.2443 2990.4736 2991.0470 2995.8460 3085.7812 3088.5083 3098.5196 3099.3217 3107.4877 3111.2537
redmass: 5.0606 1.1177 1.5731 4.6182 1.0774 1.4101 3.1131 3.1138 2.2958 5.5875 3.4338 4.2250 6.7468 4.4195 2.8944 1.7561 1.6210 1.2000 1.4022 1.4285 2.7969 2.8325 2.6558 1.1717 1.1795 1.1935 1.0474 1.0477 1.0466 1.0477 1.0509 1.0600 12.6689 1.0350 1.0352 1.0355 1.1008 1.1002 1.1003 1.1005 1.1003 1.0997
irintensity: 0.0358 0.1312 0.7246 0.5378 1.6332 0.6992 14.5532 4.3166 0.0000 17.9570 1.0389 35.8739 0.4471 73.6517 145.2082 3.2949 4.3156 0.0357 0.1287 8.4059 5.6135 3.2173 4.2363 19.1443 21.5674 8.1130 0.0001 0.1208 0.3771 15.7523 21.9339 32.1777 253.0875 25.3185 11.4626 21.3961 12.0612 14.2765 36.2307 23.5189 6.5705 26.7489
temp: 298.150 k
press: 1.00000 atm
elementType: 17 8 6 6 6 6 6 1 1 1 1 1 1 1 1 1
symmnumber: 1
zpe: 339146.5 jmol-1
zpe.correction: 0.129174 hartree
zpe.thermalcorrener: 0.138016 hartree
zpe.thermalcorrenthalpy: 0.138960 hartree
zpe.thermalcorrgfe: 0.095679 hartree
zpe.sumelectzpe: -730.655323 hartree
zpe.sumelectthermal: -730.646481 hartree
zpe.sumelectthermalent: -730.645537 hartree
zpe.sumelectthermalfe: -730.688818 hartree
dipole: -3.3054 -1.7509 0.0002
dipole: 3.7405
quadrupole: -52.0045 -53.6378 -48.2934
quadrupole: -0.5794 -0.0008 0.0001
quadrupole: -0.6926 -2.3259 3.0185 -0.5794 -0.0008 0.0001
hfenergy: -730.784497 hartree
pointgroup: C01 [X(C5H9Cl1O1)]
dipole: -1.4554752 0.2171882 -0.0104163 debye
dipolederiv: -0.6510241 -0.4120681 0.0030197 -0.4396502 -0.72455 0.0049848 0.003457 0.0052474 -0.1755761 -0.5104614 0.2622046 -0.0052825 -0.0827333 -1.131412 0.0125479 -0.0007033 0.014255 -0.1569968 -0.0565751 0.1089287 -0.0023731 -0.0089307 -0.1043513 0.0025783 -0.0010892 0.0032706 0.0905589 -0.036039 -0.0088891 -0.0152228 -0.0565585 0.006347 0.038735 0.0585062 0.029849 0.0208394 -0.0325732 -0.0711989 0.0006435 0.0385532 0.0001787 0.0007083 -0.0008069 0.0000854 0.0373977 -0.0353579 -0.0080293 0.0147428 -0.0579406 0.0042573 -0.0388141 -0.0571113 -0.0294361 0.0221242 1.2336369 0.0942155 0.0049902 0.5633513 1.7591485 -0.0198342 -0.0013628 -0.0222919 0.048668 0.0979226 0.0355434 0.0438256 0.0295119 0.0149741 -0.1190892 0.0207563 -0.0651016 -0.0869589 -0.1398133 0.0585242 -0.0160077 0.0517198 0.0943608 0.0170021 0.0013521 0.0079774 0.0744816 0.0691584 -0.1133894 0.0142587 -0.0773632 -0.0532422 0.0318368 -0.0066965 -0.0135682 0.0846987 0.0911646 0.0307887 0.0525049 -0.0102084 0.0092692 -0.0887495 0.0248268 -0.1142981 -0.061613 -0.149582 0.0164229 -0.001487 0.0591526 0.0499311 0.001022 -0.0020705 0.0008311 0.1027209 0.0918902 0.0281947 -0.0517839 -0.0117544 0.0148838 0.086567 -0.0229814 0.112442 -0.067998 0.0694573 -0.113689 -0.0108759 -0.0765787 -0.054005 -0.0284092 0.0088742 0.0165815 0.0850183 -0.1402328 0.0586306 0.0125368 0.0513731 0.0938295 -0.0170605 -0.0047357 -0.0080689 0.0753906 0.0984288 0.0338105 -0.0434894 0.0280561 0.0203804 0.1159745 -0.020215 0.0622255 -0.0927555 unknown
polarizability: 71.3975771|7.7592538|73.0745415|-0.0100766|-0.2220334|53.1722799 unknown
InChI: InChI=1S/C5H9ClO/c1-5(2,3)4(6)7/h1-3H3
charge 0 multiplicity 1
16 atoms
Cl 2.007673 1.199467 -0.006122
O  1.320413 -1.445469 0.025416
C  -0.661829 0.073256 -0.004843
C  -0.958131 0.895147 -1.292921
C  -1.509565 -1.227558 0.009499
C  -0.970399 0.931763 1.2563
C  0.818337 -0.330556 0.008191
H  -0.725332 0.315625 -2.204073
H  -2.034011 1.146424 -1.309226
H  -0.37646 1.831053 -1.31469
H  -1.297462 -1.854837 -0.873431
H  -2.580868 -0.959983 0.000493
H  -1.306255 -1.829793 0.911737
H  -0.390756 1.869198 1.255611
H  -2.046879 1.18101 1.256414
H  -0.743977 0.379755 2.185944
