program: Gaussian 09
title: 000062449
version: EM64L-G09RevD.01
frameworkgroup: C1[X(C6H15ClO3Si)]
method: RPBEPBE
basis: SDD
operation: Freq
keyword: #p
keyword: freq=noraman
keyword: PBEPBE/SDD
title: #p freq=noraman PBEPBE/SDD
converged: YES YES NO NO
title: Mulliken charges:
elementType: Cl Si O O O C C C C C C H H H H H H H H H H H H H H H
charge: -0.080101 1.550230 -0.592845 -0.577704 -0.576062 -0.912918 -0.262948 -0.580397 -0.476697 -0.488415 -0.489296 0.254735 0.254884 0.235964 0.237300 0.255317 0.255281 0.218410 0.220407 0.229474 0.241111 0.215405 0.205686 0.205319 0.216711 0.241152
chargesum: 0.00000
title: Mulliken charges with hydrogens summed into heavy atoms:
elementType: Cl Si O O O C C C C C C
charge: -0.080101 1.550230 -0.592845 -0.577704 -0.576062 -0.403300 0.210315 -0.069799 0.191594 0.173787 0.173885
polarizability: 1.28593556e+02 2.90536431e-02 9.90047527e+01 -7.71873880e+00 4.69791074e-02 8.73669885e+01
1716.lowfreq: -11.5663 -0.0015 0.0007 0.0011 6.6012 16.3153 23.2732 25.1369 52.4430
frequency: 17.0290 24.0145 52.4246 62.0472 63.9825 71.6706 79.3497 81.4498 82.3097 108.8275 109.6788 138.1167 149.1894 195.1138 225.1970 228.6132 292.3384 341.4229 358.6112 408.7154 554.1035 673.0731 687.9785 714.4146 757.5991 787.9346 814.4955 987.4268 1010.5082 1047.1281 1052.8712 1064.0400 1071.4628 1083.3959 1120.2969 1123.7643 1124.4897 1144.0915 1146.6919 1151.0893 1216.6759 1244.3578 1274.4599 1293.2313 1341.1172 1433.2326 1445.3062 1448.0457 1450.8038 1456.7382 1468.5289 1468.7547 1473.4928 1474.5696 1475.6074 1476.6865 1484.8712 2943.0790 2944.7756 2960.9061 2988.6563 3010.2427 3025.8827 3026.5377 3039.7145 3045.4937 3048.4650 3069.1221 3091.9739 3092.1845 3095.2733 3128.8078
redmass: 3.4088 4.4714 3.6797 3.4194 1.8996 1.4837 1.1283 1.5877 1.0239 3.1621 3.1407 4.1871 2.8174 5.6006 5.4787 4.0190 5.5581 5.9431 4.8584 7.4089 6.4606 7.4923 2.9595 8.7772 1.2574 5.3982 1.4921 1.3711 5.0599 6.9787 5.0648 3.2904 4.6459 1.0591 1.2508 1.2529 1.2518 1.3800 1.4325 1.4929 1.2339 1.3150 1.2326 1.0850 1.3740 1.0837 1.1221 1.1221 1.1149 1.0932 1.0515 1.0520 1.0527 1.0529 1.0517 1.0518 1.0877 1.0333 1.0336 1.0311 1.0588 1.0604 1.1025 1.1026 1.1001 1.0563 1.1038 1.1033 1.0993 1.0993 1.1018 1.1114
irintensity: 1.2956 0.8112 3.5164 5.1205 0.3716 0.9165 0.6866 2.6490 0.1070 2.4205 0.0572 17.6924 13.4348 24.0781 5.9101 3.9377 8.0489 16.1789 18.3105 46.9373 26.0789 22.8994 13.0563 122.5880 39.6314 116.1869 23.2888 7.8183 52.5644 225.6227 437.4451 19.7477 15.5128 26.5490 0.1387 1.1380 0.9109 26.6612 78.8390 0.2691 29.8800 6.1212 46.2074 0.1088 5.0071 12.8427 1.0631 0.3331 2.6680 6.4515 10.4935 13.1318 6.2352 7.3615 1.3368 9.5293 8.5158 143.1157 14.1495 76.4224 8.3893 10.5244 2.2362 122.5018 3.4180 27.9703 50.6093 17.6042 16.5832 51.0860 31.0839 23.5019
temp: 298.150 k
press: 1.00000 atm
elementType: 17 14 8 8 8 6 6 6 6 6 6 1 1 1 1 1 1 1 1 1 1 1 1 1 1 1
symmnumber: 1
zpe: 548156.1 jmol-1
zpe.correction: 0.208782 hartree
zpe.thermalcorrener: 0.226030 hartree
zpe.thermalcorrenthalpy: 0.226974 hartree
zpe.thermalcorrgfe: 0.159274 hartree
zpe.sumelectzpe: -1211.884153 hartree
zpe.sumelectthermal: -1211.866905 hartree
zpe.sumelectthermalent: -1211.865961 hartree
zpe.sumelectthermalfe: -1211.933660 hartree
dipole: -2.4866 0.0231 2.7275
dipole: 3.6910
quadrupole: -89.5438 -69.2593 -88.2003
quadrupole: 0.1098 1.3399 0.0167
quadrupole: -7.2094 13.0752 -5.8658 0.1098 1.3399 0.0167
hfenergy: -1212.0929348 hartree
pointgroup: C01 [X(C6H15Cl1O3Si1)]
dipole: 0.9646523 0.0042214 1.0854154 debye
dipolederiv: -0.7163373 -0.0039136 -0.1031119 -0.0037777 -0.1835333 -0.0008993 -0.2503416 -0.0019182 -0.2617935 2.3235027 -0.000517 0.0326306 0.0107572 2.2354218 -0.0026388 0.1735024 0.0013722 1.524314 -1.7010209 -0.0167077 -0.2203086 -0.0069076 -0.7006809 -0.0054218 -0.2681517 -0.0075404 -0.6569554 -0.7567589 -0.0542672 0.0250056 -0.0534162 -1.5536104 0.1693735 0.0222889 0.2307206 -0.6063882 -0.757604 0.057418 0.0252896 0.0561647 -1.5490235 -0.1598569 0.0223795 -0.22188 -0.5996766 -0.624975 -0.003305 0.0399562 -0.0038384 -0.2438441 0.0004162 0.1277586 -0.0002701 -0.2236816 -0.0664365 -0.0014216 -0.0187069 -0.0023792 0.1001231 0.0000391 0.0340751 0.0018337 -0.0136814 0.7787025 0.0041938 0.2150978 0.0041806 0.2152946 0.0013717 0.2459167 0.0015557 0.3151105 0.9322478 0.0148605 0.1450391 0.0085424 0.3118155 -0.000195 -0.0983675 -0.0016325 0.2256796 0.3260784 -0.0031133 0.0084625 0.0495471 0.9790564 -0.0962824 0.0121651 0.149746 0.2075267 0.3259526 0.0073426 0.0119914 -0.0547139 0.9747717 0.0910442 0.0145681 -0.1547554 0.2075643 0.0951716 -0.0726217 0.0231337 -0.0169843 -0.0323316 0.1221856 -0.0399629 0.1207096 0.0109197 0.0957285 0.0748972 0.026214 0.0193334 -0.0291522 -0.1212112 -0.0369002 -0.1210322 0.0100837 0.0716818 0.0073568 -0.0023484 -0.0049939 -0.0413411 -0.0970263 0.0194623 -0.089546 0.0071492 0.0731767 -0.0050666 -0.0032903 0.007172 -0.0390857 0.0961669 0.0176146 0.0886725 0.0070262 -0.0109713 -0.0105229 -0.0625517 0.0287471 -0.0380766 -0.1101618 -0.0226531 -0.0857785 -0.0237514 -0.0108262 0.0103137 -0.0638137 -0.0288727 -0.0368869 0.1096532 -0.0233848 0.0857169 -0.0252798 -0.0551626 -0.0460142 0.0086733 -0.119087 -0.1186519 0.0760649 0.0852168 0.0951727 0.0578831 -0.0441545 0.0316468 0.0174338 0.0907903 -0.0606727 -0.1040458 0.1068483 -0.1182401 0.008392 -0.0662775 0.0096917 -0.1027553 0.0178928 0.1012236 0.0292155 -0.139776 0.0265006 -0.0965258 0.1025636 -0.0121987 0.0150407 -0.0195148 -0.0634276 0.1082502 0.0217892 0.1389872 -0.0658142 -0.0788104 -0.0901785 -0.1098128 -0.0412639 -0.0413681 -0.0236979 -0.1317548 -0.1172824 -0.0012638 -0.1297747 0.1055118 0.094196 0.0449903 -0.0412793 -0.0199105 0.1089751 -0.0985073 0.0303781 -0.1357292 -0.1053782 0.0910298 -0.0442625 -0.0390464 0.0200205 0.1060379 0.0961315 0.0338215 -0.0713105 0.0862607 -0.110837 0.0404181 -0.0414046 0.0253263 -0.1326067 0.1197732 -0.0076326 0.1013432 0.0157325 0.0183424 0.0214761 -0.0642899 -0.1077802 0.0253007 -0.1385089 -0.063404 unknown
polarizability: 128.3877856|0.3410722|99.0080662|8.2382345|-0.0115148|87.5694458 unknown
InChI: InChI=1S/C6H15ClO3Si/c1-8-11(9-2,10-3)6-4-5-7/h4-6H2,1-3H3
charge 0 multiplicity 1
26 atoms
Cl -4.800702 -0.041884 -0.225778
Si 0.891868 0.005527 0.003739
O  2.126398 0.028476 1.20624
O  1.01171 1.330074 -1.08173
O  1.062548 -1.323466 -1.070102
C  -0.738641 -0.016794 0.970516
C  -1.989296 -0.025641 0.048591
C  -3.267045 -0.029482 0.88881
C  3.567413 0.038841 0.951368
C  0.973527 2.741427 -0.719683
C  1.009096 -2.732729 -0.700575
H  -0.737052 -0.904771 1.633274
H  -0.754068 0.86706 1.63874
H  -1.976819 -0.913259 -0.611067
H  -1.984883 0.858126 -0.616196
H  -3.367981 0.876054 1.507511
H  -3.358342 -0.931256 1.514439
H  3.885248 1.000185 0.503801
H  3.865425 -0.783714 0.272649
H  4.064939 -0.091328 1.926112
H  1.061001 3.310237 -1.659344
H  1.813234 3.016609 -0.050817
H  0.019246 3.016297 -0.224615
H  0.042691 -3.000275 -0.225294
H  1.832538 -3.007444 -0.01173
H  1.114447 -3.307469 -1.63476
