program: Gaussian 09
title: 000062445
version: EM64L-G09RevD.01
frameworkgroup: C1[X(C10H20O2)]
method: RPBEPBE
basis: SDD
operation: Freq
keyword: #pfreq=noraman
keyword: PBEPBE/SDD
title: #p freq=noraman PBEPBE/SDD
converged: YES YES NO NO
title: Mulliken charges:
elementType: O O C C C C C C C C C C H H H H H H H H H H H H H H H H H H H H
charge: -0.275517 -0.248670 -0.051724 -0.355051 -0.300603 -0.054319 -0.509358 -0.713850 -0.713379 0.273478 -0.690513 -0.688424 0.189514 0.194477 0.217949 0.239031 0.225290 0.208887 0.230184 0.224426 0.232282 0.208005 0.211150 0.218635 0.209032 0.218551 0.240569 0.204634 0.211677 0.218383 0.214262 0.210991
chargesum: 0.00000
title: Mulliken charges with hydrogens summed into heavy atoms:
elementType: O O C C C C C C C C C C
charge: -0.275517 -0.248670 0.137791 0.057375 0.163717 0.154568 -0.054747 -0.062413 -0.067161 0.273478 -0.033633 -0.044787
polarizability: 1.32669448e+02 -1.55939722e-01 1.07878794e+02 -1.70662793e+00 -1.06268672e+00 1.03202152e+02
1716.lowfreq: -14.9237 -6.9756 -0.0007 0.0008 0.0008 0.6208 16.5250 22.5242 39.4178
frequency: 12.1533 21.6690 38.4380 64.9706 92.7047 127.7642 137.5093 193.3488 200.5453 211.4080 224.6132 230.5975 236.8079 284.0005 309.0873 358.5187 366.1514 407.6574 437.3370 459.4132 547.7854 574.6982 727.6220 770.9458 785.2556 789.8623 838.5654 892.3688 903.5207 918.5858 929.3569 947.2711 962.0878 965.2993 968.4014 1022.6709 1049.3706 1063.1428 1103.5627 1111.1059 1129.4538 1169.0673 1180.7855 1188.2538 1221.7197 1249.4243 1258.1415 1265.2007 1289.6378 1329.8237 1338.3132 1345.6124 1346.8223 1361.5404 1383.8847 1390.0503 1394.6724 1402.5475 1448.5699 1462.4532 1465.3286 1466.5049 1470.2195 1476.8656 1479.7716 1482.2186 1485.2098 1486.9248 1492.4282 1629.8748 2956.3057 2970.8058 2974.1271 2974.7821 2979.4735 2980.6292 2982.1928 3007.5466 3014.6493 3033.3189 3066.9219 3068.7280 3070.1627 3071.4307 3072.7202 3074.1999 3076.9427 3084.0239 3085.2003 3087.2477
redmass: 3.1047 5.1534 3.1333 2.5531 2.2191 2.4317 2.9686 1.3399 2.0352 1.0709 2.0472 1.4380 1.4699 2.2210 3.2470 2.1491 2.0501 1.9795 2.4723 2.8315 2.6663 4.7973 3.7211 2.0001 2.1805 2.0729 2.8017 2.3196 1.6329 1.8905 1.3481 1.6899 1.4706 1.5670 1.9307 1.5213 3.0280 1.9766 1.4939 1.6190 1.9243 2.5431 1.9529 2.1765 1.1581 1.2691 1.2389 1.5056 1.3205 1.5063 1.5631 1.4199 1.4689 1.4203 1.2137 1.2226 1.2143 1.2149 1.1022 1.0556 1.0538 1.0609 1.0597 1.0472 1.0629 1.0476 1.0533 1.0598 1.0558 9.5885 1.0808 1.0809 1.0361 1.0357 1.0412 1.0377 1.0563 1.0597 1.0599 1.0996 1.1031 1.0995 1.1002 1.1003 1.0991 1.1021 1.0995 1.1032 1.0995 1.0996
irintensity: 0.0520 1.6574 0.0161 0.4784 0.2134 0.3621 0.4521 1.0416 2.3581 0.1313 6.6672 0.2618 1.6075 3.6378 0.8860 0.1217 2.2990 0.9676 1.1713 1.1854 1.2722 7.4477 6.2494 8.6275 1.7063 2.8795 5.8075 14.3729 1.4356 9.0025 9.5553 27.2131 9.2713 3.9974 31.6749 6.5912 9.3781 127.3702 1.8581 2.2069 0.3680 187.2427 2.3397 40.0183 4.7834 45.5763 2.9133 47.0647 0.7693 1.2020 0.2851 7.9056 4.2465 5.9852 20.7562 17.0253 16.6079 16.5307 9.1812 2.8205 5.6568 0.0588 2.8839 13.8158 19.6956 20.6996 21.0678 15.7621 8.8738 176.3215 22.3120 23.5856 39.3274 30.4221 19.7043 25.5119 42.6691 27.0155 21.5630 10.3597 27.2344 49.8863 39.7390 8.9904 96.6051 19.7636 55.7166 27.1771 49.4241 41.7237
temp: 298.150 k
press: 1.00000 atm
elementType: 8 8 6 6 6 6 6 6 6 6 6 6 1 1 1 1 1 1 1 1 1 1 1 1 1 1 1 1 1 1 1 1
symmnumber: 1
zpe: 741738.0 jmol-1
zpe.correction: 0.282513 hartree
zpe.thermalcorrener: 0.298105 hartree
zpe.thermalcorrenthalpy: 0.299049 hartree
zpe.thermalcorrgfe: 0.237413 hartree
zpe.sumelectzpe: -542.521361 hartree
zpe.sumelectthermal: -542.505769 hartree
zpe.sumelectthermalent: -542.504825 hartree
zpe.sumelectthermalfe: -542.566461 hartree
dipole: 0.9431 0.9754 -1.5916
dipole: 2.0914
quadrupole: -70.2210 -76.9325 -79.2944
quadrupole: -2.2774 6.0267 2.9389
quadrupole: 5.2616 -1.4499 -3.8117 -2.2774 6.0267 2.9389
hfenergy: -542.8038737 hartree
pointgroup: C01 [X(C10H20O2)]
dipole: 0.3801223 -0.4082803 0.604869 debye
polarizability: 132.5442475|1.1929306|108.0593703|2.2504947|-0.6305133|103.1467761 unknown
InChI: InChI=1S/C10H20O2/c1-5-9(4)7-12-10(11)6-8(2)3/h8-9H,5-7H2,1-4H3
charge 0 multiplicity 1
32 atoms
O  0.292867 0.704384 0.289087
O  -1.204342 1.42129 -1.344109
C  2.702671 0.39319 -0.020063
C  2.6416 -1.136262 0.24517
C  1.418126 0.930509 -0.66979
C  -2.778715 -0.677505 0.624498
C  -2.044875 0.685113 0.865513
C  3.045513 1.172437 1.271803
C  2.494848 -2.002827 -1.02487
C  -0.992506 0.989707 -0.185104
C  -3.614975 -0.667226 -0.675942
C  -1.797009 -1.872563 0.658811
H  3.50882 0.576608 -0.764573
H  3.570261 -1.427095 0.775708
H  1.803344 -1.341977 0.938738
H  1.174721 0.421769 -1.619351
H  1.483708 2.016517 -0.869084
H  -3.477546 -0.786324 1.480166
H  -1.565905 0.671421 1.859637
H  -2.791995 1.49928 0.837793
H  2.255413 1.03036 2.030183
H  3.13834 2.257281 1.07667
H  4.002258 0.82004 1.69868
H  1.527828 -1.832506 -1.533431
H  3.300664 -1.786389 -1.752148
H  2.547636 -3.078369 -0.775347
H  -2.972732 -0.527953 -1.563536
H  -4.161748 -1.621726 -0.789056
H  -4.355157 0.154055 -0.670825
H  -1.097829 -1.840588 -0.197925
H  -1.192609 -1.873567 1.584582
H  -2.350277 -2.828188 0.605715
