program: Gaussian 09
title: 000073337
version: EM64L-G09RevD.01
frameworkgroup: C1[X(C20H24NO4)]
method: RPBEPBE
basis: SDD
operation: Freq
keyword: #p
keyword: freq=noraman
keyword: PBEPBE/SDD
title: #p freq=noraman PBEPBE/SDD
converged: YES YES NO NO
title: Mulliken charges:
elementType: O O O O N C C C C C C C C C C C C C C C C C C C C H H H H H H H H H H H H H H H H H H H H H H H H
charge: -0.388157 -0.315727 -0.407160 -0.325923 -0.110746 -0.184606 -0.413311 0.053232 -0.675425 -0.571537 0.393620 -0.566568 -0.611180 0.131188 0.458285 0.087646 -0.568466 -0.017607 0.222578 -0.518132 0.041363 0.206346 -0.344136 -0.517177 -0.519313 0.282205 0.286261 0.266522 0.253287 0.228032 0.266392 0.250026 0.267499 0.262162 0.263959 0.299245 0.276363 0.260551 0.259559 0.243864 0.255405 0.394932 0.394793 0.234556 0.230715 0.261297 0.256190 0.235757 0.231339
chargesum: 1.00000
title: Mulliken charges with hydrogens summed into heavy atoms:
elementType: O O O O N C C C C C C C C C C C C C C C C C C C C
charge: 0.006774 -0.315727 -0.012367 -0.325923 -0.110746 0.097599 0.139472 0.053232 -0.194105 -0.055118 0.393620 0.227051 0.224980 0.131188 0.458285 0.087646 -0.308907 -0.017607 0.222578 -0.274268 0.041363 0.206346 -0.088730 0.209390 0.203974
polarizability: 3.25110405e+02 1.21064222e+01 2.78583910e+02 -3.93080269e+00 -8.47659526e+00 1.41852936e+02
1716.lowfreq: -0.0011 -0.0008 -0.0007 4.0750 6.0486 11.2332 44.2163 53.2527 58.1300
frequency: 44.1895 53.1542 58.1070 85.8118 98.8492 111.7229 141.3519 154.2061 168.7448 179.7068 195.5694 206.7237 217.2340 219.5803 230.9402 237.0940 254.9667 275.6188 283.9521 299.8797 305.6985 308.1100 322.5652 349.6579 353.0776 368.7751 390.1859 404.8000 436.1353 450.2898 468.0745 484.0230 490.9192 502.5315 510.8105 516.5071 534.5594 542.0910 554.4454 575.7581 623.1070 625.9756 647.9590 675.1735 713.1410 722.9921 740.1672 745.5387 757.5875 767.2786 797.9886 812.2931 839.6012 856.8362 884.6212 910.3363 918.8680 924.6958 945.3194 972.6935 982.2899 1016.8125 1025.7385 1045.8179 1063.9536 1072.9877 1095.4931 1116.0553 1116.6649 1117.8273 1128.6180 1145.8947 1152.7460 1162.4865 1171.8964 1187.4631 1189.3521 1205.4694 1221.9843 1224.4239 1227.8173 1236.3245 1251.4063 1261.3734 1276.0497 1283.2586 1297.6604 1300.4487 1320.2994 1337.2203 1356.1456 1374.7128 1403.4439 1412.8663 1423.4073 1433.3706 1440.0654 1443.8171 1444.3081 1451.6488 1459.4445 1462.9874 1465.3777 1468.0355 1468.5427 1469.3491 1471.7432 1474.7643 1480.4519 1484.2192 1485.5186 1499.6330 1501.5591 1589.2343 1600.3033 1612.0344 1624.0895 2969.9707 2978.2651 2978.4079 2981.2664 2983.8454 3021.2441 3027.1601 3031.6119 3035.4639 3056.7031 3073.9323 3074.2946 3096.6169 3137.9230 3139.0357 3141.9028 3142.4591 3143.6904 3151.7922 3153.9274 3158.6326 3172.5389 3479.6148 3492.1079
redmass: 4.2013 3.9097 3.2587 4.4676 4.1311 4.4439 3.8814 3.0282 3.9198 2.3803 1.6353 1.6974 2.1849 1.2298 2.9870 2.6804 1.9015 2.2508 3.4363 3.0290 2.9366 1.9954 4.3041 3.7536 3.9274 3.3063 4.2910 4.2419 3.1151 4.8804 3.5305 1.7161 3.0467 2.1660 3.3940 1.1828 4.4254 3.6698 4.2497 4.2155 5.2880 4.4703 6.1484 4.0659 5.3614 3.4070 5.6187 5.6079 3.9605 5.0044 1.4215 3.3615 1.4992 4.5729 3.1498 1.4380 2.2966 3.4719 2.3631 4.8875 2.5723 3.2232 2.5230 2.4800 3.6032 2.3461 1.2998 1.2576 1.2542 2.9227 1.6196 1.4643 1.7071 1.5697 1.4053 1.6558 1.5592 1.6410 1.7569 1.4523 1.9368 1.6193 1.5585 2.2281 2.2862 1.9474 1.8736 1.7001 2.0680 1.4911 1.9075 1.3253 4.1328 3.6170 1.1661 1.7862 1.9282 1.2005 1.4230 1.1905 1.1410 1.6658 1.1490 1.0497 1.1825 1.0988 1.1399 1.0829 1.0888 1.0788 2.5398 1.0792 4.1419 7.2737 7.4303 7.5539 7.2400 1.0808 1.0323 1.0325 1.0642 1.0640 1.0649 1.0350 1.0342 1.0880 1.0998 1.1051 1.1052 1.1081 1.1046 1.0901 1.1006 1.1042 1.1005 1.0917 1.1037 1.1047 1.0947 1.0643 1.0645
irintensity: 7.0691 1.3146 3.5811 1.8150 1.2848 1.7297 3.7808 0.1922 0.5769 0.6455 1.3294 1.9671 0.8883 0.0781 1.3188 2.7791 1.1615 1.4359 4.5028 2.4649 3.7973 1.6717 5.4988 1.9676 1.8640 6.6307 2.6671 6.5949 4.8019 2.4427 13.5315 84.2353 20.7308 55.5543 20.4469 45.3211 4.5198 4.0745 3.6352 4.1966 6.5551 7.8193 3.4864 1.5385 1.9477 4.9571 2.3320 13.0294 3.4272 3.7406 59.0514 46.4126 33.9190 13.0348 2.2565 2.4054 6.9511 31.0453 28.3217 70.2424 22.4144 63.9380 16.6475 9.1765 43.8985 10.1742 0.0891 0.3841 0.0602 75.4536 20.7511 10.8836 7.4523 51.4267 14.7488 17.0922 12.8001 54.4302 20.0304 22.4345 77.6071 99.3634 80.9122 148.1530 101.5585 30.5006 36.4869 90.3710 12.4825 22.0292 14.9369 5.6107 73.0993 6.9298 23.4742 84.5570 7.1373 33.8538 17.0286 27.4263 20.7924 91.8857 25.5287 19.0092 44.6819 58.1318 13.2962 7.3314 29.5224 31.5005 44.3742 16.9837 80.1519 14.4504 13.5791 43.5856 4.8471 16.6425 101.5223 6.2419 30.4640 25.8282 6.1582 3.6286 12.0097 12.6598 26.9892 31.7589 34.4258 11.5910 4.3234 12.1027 8.8243 5.5932 12.0218 3.6556 3.6643 2.2870 7.1314 129.3850 133.3595
temp: 298.150 k
press: 1.00000 atm
elementType: 8 8 8 8 7 6 6 6 6 6 6 6 6 6 6 6 6 6 6 6 6 6 6 6 6 1 1 1 1 1 1 1 1 1 1 1 1 1 1 1 1 1 1 1 1 1 1 1 1
symmnumber: 1
zpe: 1064245.2 jmol-1
zpe.correction: 0.405350 hartree
zpe.thermalcorrener: 0.428407 hartree
zpe.thermalcorrenthalpy: 0.429351 hartree
zpe.thermalcorrgfe: 0.355548 hartree
zpe.sumelectzpe: -1130.078080 hartree
zpe.sumelectthermal: -1130.055023 hartree
zpe.sumelectthermalent: -1130.054079 hartree
zpe.sumelectthermalfe: -1130.127882 hartree
dipole: 7.8180 -6.9482 -0.7947
dipole: 10.4895
quadrupole: -60.6181 -83.4227 -142.3502
quadrupole: -7.1232 -0.2704 -0.0212
quadrupole: 34.8456 12.0410 -46.8865 -7.1232 -0.2704 -0.0212
hfenergy: -1130.4834297 hartree
pointgroup: C01 [X(C20H24N1O4)]
dipole: 3.493903 2.1628943 0.3818267 debye
polarizability: 319.312872|-18.9951975|283.8841293|7.3961961|-11.185238|142.3502488 unknown
InChI: InChI=1S/C20H24NO4/c1-21(2)8-7-12-10-15(25-4)20(23)18-16(12)13(21)9-11-5-6-14(24-3)19(22)17(11)18/h5-6,10,13,22-23H,7-9H2,1-4H3
charge 1 multiplicity 1
49 atoms
O  -1.252241 -2.587342 -0.865613
O  0.750299 -4.202742 -0.319943
O  -2.76613 -1.21579 0.88186
O  -4.809308 0.362101 0.425953
N  2.808262 1.976576 0.17054
C  1.327934 1.463993 0.195471
C  3.605525 1.170653 1.221207
C  1.261556 -0.064716 0.188049
C  0.480442 2.016139 -0.979246
C  3.723543 -0.301039 0.827282
C  2.377257 -0.892489 0.435258
C  2.850993 3.444956 0.57626
C  3.440627 1.819237 -1.207545
C  -0.030377 -0.620725 -0.11491
C  -0.963931 1.621743 -0.7048
C  -1.193713 0.291599 -0.225786
C  2.249236 -2.302195 0.318088
C  -0.109362 -2.015457 -0.339595
C  1.027066 -2.850086 -0.090816
C  -2.022798 2.527726 -0.878077
C  -2.504597 -0.041242 0.195144
C  -3.580304 0.879111 -0.013705
C  -3.353476 2.149708 -0.564456
C  1.807955 -5.189428 -0.063526
C  -6.01265 1.184321 0.247186
H  0.921342 1.874624 1.143713
H  3.050307 1.28322 2.168678
H  4.592391 1.655003 1.321038
H  0.830203 1.567694 -1.93001
H  0.547681 3.115089 -1.066064
H  4.132475 -0.839025 1.703617
H  4.473182 -0.430826 0.021782
H  2.488113 3.543372 1.610636
H  3.890293 3.802868 0.510407
H  2.21471 4.035157 -0.097653
H  3.254811 0.80245 -1.579344
H  2.994253 2.551781 -1.894224
H  4.52282 2.004742 -1.120445
H  3.111749 -2.943367 0.525114
H  -1.825952 3.535015 -1.260299
H  -4.174775 2.85447 -0.719513
H  -1.138945 -3.576413 -0.887184
H  -3.747566 -1.272501 1.045126
H  2.117676 -5.161663 0.997563
H  2.677295 -5.010102 -0.723104
H  1.357621 -6.164165 -0.296227
H  -6.840448 0.576266 0.637765
H  -6.179022 1.403783 -0.823619
H  -5.932623 2.125314 0.822669
