program: Gaussian 09
title: 000073488
version: EM64L-G09RevD.01
frameworkgroup: C1[X(C17H22N4O6)]
method: RPBEPBE
basis: SDD
operation: Freq
keyword: #p
keyword: freq=noraman
keyword: PBEPBE/SDD
title: #p freq=noraman PBEPBE/SDD
converged: YES YES NO NO
title: Mulliken charges:
elementType: O O O O O O N N N N C C C C C C C C C C C C C C C C C H H H H H H H H H H H H H H H H H H H H H H
charge: -0.254113 -0.316295 -0.250722 -0.261331 -0.269903 -0.486339 -0.321222 -0.194547 -0.393334 -0.621387 -0.304945 0.295479 -0.223515 -0.408947 -0.232470 0.093381 0.165254 -0.313249 -0.106953 -0.177528 -0.546182 0.207760 0.259448 -0.859661 0.309766 -0.343031 -0.332727 0.267516 0.257331 0.270667 0.248969 0.276430 0.280961 0.232145 0.289435 0.211578 0.236069 0.238008 0.224872 0.219913 0.291957 0.368850 0.235973 0.282483 0.329577 0.341618 0.209399 0.212207 0.361356
chargesum: 0.00000
title: Mulliken charges with hydrogens summed into heavy atoms:
elementType: O O O O O O N N N N C C C C C C C C C C C C C C C C C
charge: -0.254113 -0.316295 -0.250722 -0.261331 -0.269903 -0.124983 -0.050556 -0.194547 -0.024484 0.049808 -0.037429 0.295479 0.033816 0.116452 0.048491 0.093381 0.165254 0.208330 -0.106953 -0.177528 0.139473 0.207760 0.259448 -0.122919 0.309766 0.175425 0.088880
chargesum: -0.00009
polarizability: 3.15180700e+02 3.66994795e+01 2.72883171e+02 -9.73111653e+00 1.36432441e+01 1.59191253e+02
1716.lowfreq: -10.4844 -2.1220 -0.2014 -0.0921 3.0746 5.2907 17.1752 22.6447 31.2870
frequency: 16.2809 22.5209 31.0621 40.4841 45.3188 53.3845 74.2055 79.8632 87.2023 93.2888 118.8051 128.6751 134.6307 150.7168 155.4265 173.7220 191.0037 201.5103 205.1271 220.9739 226.9329 260.0860 268.3860 286.5115 288.5275 315.9836 322.2684 331.1911 350.0823 377.5287 401.4014 415.5495 423.0476 441.4295 463.1304 477.9467 482.7210 484.2551 504.9479 507.5756 535.9820 551.9357 574.5833 620.9376 634.8556 681.1643 703.9224 711.9375 728.7864 737.2634 749.7877 763.5680 783.9021 796.2948 805.9189 825.0661 844.0593 880.9514 893.1259 912.2251 930.0505 944.3883 955.8735 972.1974 988.8884 1001.5929 1012.5894 1031.7028 1036.0925 1039.9194 1043.1725 1056.7847 1061.3184 1071.6540 1080.5437 1101.6724 1115.1349 1120.9526 1123.9717 1136.3447 1151.8758 1175.0780 1182.3346 1193.5836 1201.4617 1207.9684 1212.5861 1224.6588 1237.5721 1254.6408 1285.5465 1292.8833 1299.1077 1311.6928 1329.5393 1334.6342 1347.9170 1370.1395 1375.1530 1386.7729 1396.3948 1415.7278 1434.4778 1435.4033 1460.6490 1465.9590 1470.7901 1473.4864 1476.7160 1483.6277 1484.1640 1487.5407 1491.3161 1509.6701 1538.6564 1568.9810 1588.9824 1590.7919 1691.0648 2950.0350 2955.8210 2967.3922 2978.5374 3011.5840 3016.4504 3016.9619 3027.7753 3033.0791 3042.2329 3094.0842 3096.9625 3098.6075 3105.9467 3111.3571 3166.7174 3188.5170 3325.0924 3461.1743 3559.8101 3599.0996 3717.3185
redmass: 6.6007 4.6517 6.0869 4.7860 5.4046 3.8965 4.6579 3.7058 5.1778 3.4951 3.6205 4.8452 2.5033 3.9798 2.9290 4.8131 2.5577 1.2511 2.4349 5.1659 3.2434 3.9575 3.2539 1.1980 3.5570 5.1317 2.7924 2.7667 3.8638 6.1494 7.1123 4.2348 5.2181 4.3172 4.0011 6.6227 4.0045 1.2682 1.2668 2.7413 3.6202 4.6917 5.1863 3.5786 5.2661 4.4025 10.9543 4.8581 4.4295 4.4293 4.6269 1.3789 4.1784 4.2595 6.7786 2.3111 4.3959 3.8811 3.4227 2.2880 2.5763 1.4999 3.1781 2.9256 5.3269 3.7837 2.9181 3.3784 2.3628 1.4510 2.1373 2.0645 2.9414 1.7568 1.6388 2.5083 1.4172 1.6771 1.9322 1.6184 1.5723 1.7122 1.4949 1.7021 1.4949 1.2004 1.4105 1.5383 1.4626 1.2539 1.9221 2.0447 1.6548 1.4545 1.4237 2.1120 3.9983 2.4827 2.1253 1.5060 1.4398 4.4919 1.1626 1.4428 1.0599 2.8193 1.0851 1.1032 1.2565 1.0799 1.0767 1.6957 1.0649 3.5492 7.0741 5.3617 1.2460 5.7358 7.5205 1.0397 1.0323 1.0578 1.0695 1.0815 1.0637 1.0978 1.0590 1.1072 1.1029 1.0941 1.1009 1.1081 1.1003 1.0926 1.0915 1.0949 1.0757 1.0747 1.0445 1.0669 1.1058
irintensity: 2.3983 1.9492 1.2306 6.6199 3.4653 1.4476 0.7364 1.2472 3.8360 6.1822 2.9730 3.4501 3.3446 2.6183 5.3749 7.8308 6.3370 6.0518 3.1763 3.3789 3.7633 12.4289 5.8921 136.8253 6.5224 4.7469 7.0077 2.4604 3.9240 40.9873 22.0729 10.7363 4.0213 8.9063 7.9285 1.2438 26.4655 253.2353 15.5298 10.5243 6.6005 5.3699 10.9811 4.8254 3.5067 3.6728 25.4437 18.0807 3.6625 63.7278 4.6303 92.2173 18.7996 6.6174 5.4240 3.7901 56.8596 45.7247 36.4823 4.0867 0.8820 4.1581 17.5357 102.3059 111.2500 59.7894 130.7641 40.8489 20.8229 0.4682 18.4744 29.2293 55.1432 17.3277 11.5695 8.7831 4.7643 14.0192 23.3357 16.3185 19.1739 28.3162 69.5432 4.2622 23.8622 9.7377 21.7159 20.8596 21.7618 78.2474 37.0089 322.5451 130.9067 29.9252 5.1084 38.5456 36.1286 12.2979 64.8367 2.6979 6.6178 153.8253 3.1880 14.9562 7.3964 160.5087 6.2059 3.9270 42.2317 21.0451 16.3109 141.9495 19.6582 234.5681 410.7086 244.6444 111.9900 23.8983 328.5960 42.2175 65.6885 66.4079 24.0821 2.1166 26.8882 24.4868 11.7760 76.0536 38.1337 1.7487 2.6395 7.7735 25.0386 21.1135 17.0073 14.9961 4.9248 159.4490 58.0386 8.1463 48.7736
temp: 298.150 k
press: 1.00000 atm
elementType: 8 8 8 8 8 8 7 7 7 7 6 6 6 6 6 6 6 6 6 6 6 6 6 6 6 6 6 1 1 1 1 1 1 1 1 1 1 1 1 1 1 1 1 1 1 1 1 1 1
symmnumber: 1
zpe: 1009522.1 jmol-1
zpe.correction: 0.384507 hartree
zpe.thermalcorrener: 0.411641 hartree
zpe.thermalcorrenthalpy: 0.412585 hartree
zpe.thermalcorrgfe: 0.325032 hartree
zpe.sumelectzpe: -1329.268779 hartree
zpe.sumelectthermal: -1329.241645 hartree
zpe.sumelectthermalent: -1329.240701 hartree
zpe.sumelectthermalfe: -1329.328254 hartree
dipole: 0.3315 2.3323 1.3230
dipole: 2.7018
quadrupole: -97.1186 -166.6282 -166.3807
quadrupole: 12.0848 -22.1586 5.4234
quadrupole: 46.2572 -23.2524 -23.0049 12.0848 -22.1586 5.4234
hfenergy: -1329.6532861 hartree
pointgroup: C01 [X(C17H22N4O6)]
dipole: -0.1714555 0.9004119 -0.5383385 debye
polarizability: 315.3155003|-36.9401839|270.7718129|-15.7012651|-15.2119435|161.1678114 unknown
InChI: InChI=1S/C17H22N4O6/c1-7-11(19-3-4-22)14(24)10-8(6-27-16(18)25)17(26-2)15-9(20-15)5-21(17)12(10)13(7)23/h8-9,15,19-20,22H,3-6,18H2,1-2H3
charge 0 multiplicity 1
49 atoms
O  2.450747 -1.31474 -2.007189
O  2.908533 2.035578 -0.340231
O  -1.360339 -3.417412 0.634767
O  -1.531397 1.952445 -0.764381
O  2.929307 3.673638 1.357806
O  -6.547251 1.320326 0.242175
N  2.764287 -1.204283 1.831171
N  1.008233 -1.933135 -0.248569
N  -3.97029 0.572227 -0.06606
N  4.693889 3.440505 -0.174414
C  3.11468 -1.066677 0.360359
C  1.984863 -0.888872 -0.669295
C  2.937954 -2.448487 0.983003
C  1.666068 -3.088175 0.398184
C  1.135686 0.437867 -0.753942
C  -0.251495 -1.407028 -0.118286
C  -0.274596 -0.050482 -0.429697
C  1.575905 1.591765 0.155427
C  -1.470818 -2.177297 0.296761
C  -1.493168 0.701415 -0.454593
C  3.555109 -0.520874 -2.568917
C  -2.717236 -1.440367 0.289548
C  -2.760683 -0.075332 -0.076033
C  -3.975709 -2.183383 0.688196
C  3.4719 3.113925 0.375815
C  -4.329795 1.95458 -0.43101
C  -5.530366 2.380114 0.418099
H  4.085972 -0.61351 0.160334
H  3.779127 -3.091873 1.24954
H  1.760468 -1.008632 2.022552
H  1.9325 -3.85389 -0.352856
H  0.985872 -3.539795 1.13783
H  1.179619 0.7981 -1.799269
H  1.670517 1.297969 1.215243
H  0.86019 2.426735 0.075186
H  4.525148 -0.787079 -2.1051
H  3.380796 0.565972 -2.45147
H  3.58223 -0.783585 -3.638073
H  -4.722653 -2.214154 -0.131386
H  -4.467032 -1.73346 1.575064
H  -3.711087 -3.222738 0.939466
H  -4.800892 0.008308 0.153953
H  -4.604176 1.998135 -1.504719
H  -3.469819 2.622425 -0.28426
H  5.052446 2.941241 -0.98408
H  5.220965 4.204558 0.238377
H  -5.906865 3.358695 0.059835
H  -5.237776 2.462895 1.484896
H  -7.337267 1.501041 0.807439
