program: Gaussian 16
title: ts1-c3 cation [4+5] mpw
version: ES64L-G16RevA.03
method: RmPW1PW91
basis: 6-31G(d)
operation: Freq
keyword: #N
keyword: Geom=AllCheck
keyword: Guess=TCheck
keyword: SCRF=Check
keyword: GenChk
keyword: RmPW1PW91/6-31G(d)
keyword: Freq
converged: YES YES NO YES
title: Mulliken charges:
elementType: C H C H C C C H C H C H H C C C C H C H C H C H H H
charge: -0.242823 0.168959 -0.163628 0.172567 0.034468 -0.292073 -0.187908 0.183527 -0.158486 0.156484 -0.203542 0.157432 0.155352 0.179654 -0.201227 -0.240242 -0.167950 0.232069 -0.143400 0.172836 -0.140779 0.182586 -0.184290 0.177529 0.178510 0.174374
chargesum: -0.00000
title: Mulliken charges with hydrogens summed into heavy atoms:
elementType: C C C C C C C C C C C C C C
charge: -0.073864 0.008939 0.034468 -0.108546 -0.031424 -0.001054 -0.048190 0.179654 0.030842 -0.067406 0.014636 0.034129 0.037731 -0.009916
chargesum: 0.00000
1716.lowfreq: -596.9728 -5.7038 0.0001 0.0005 0.0005 2.2410 5.9393 78.5258 89.4460
frequency: -596.9728 78.5257 89.4438 117.6360 191.6143 232.5512 255.5630 300.2212 373.3831 400.6007 425.6854 454.7116 580.5514 594.3021 598.2593 648.7612 671.6958 686.2585 731.6764 750.9877 770.6969 784.7041 819.3090 844.9614 846.0845 853.3168 887.0035 898.5110 908.3368 924.5597 938.5430 953.5849 990.0207 1001.4643 1011.6986 1013.0753 1076.3308 1083.4687 1093.4476 1109.8762 1149.0720 1206.1041 1241.0080 1264.9900 1279.5072 1288.6530 1311.5453 1336.6066 1394.0800 1410.3689 1457.6660 1473.8522 1497.3797 1506.2288 1526.1414 1552.3779 1568.2364 1639.4054 1642.2694 1663.9177 3183.0890 3185.0851 3190.5883 3202.6599 3210.1964 3213.5245 3224.9161 3230.3834 3243.9003 3253.4587 3266.6184 3275.7970
redmass: 5.4699 4.0472 4.6157 3.8626 4.2277 3.5947 3.7706 3.2469 3.9767 4.7355 4.3181 4.7580 3.9772 3.2326 3.4619 3.5112 3.1886 4.9608 1.4179 1.5481 1.3508 1.5616 2.3895 1.4488 4.0303 1.4569 3.7677 1.5432 2.3810 1.8119 1.6617 2.3986 2.6463 1.4444 1.3551 1.3201 1.4409 1.3227 1.5880 1.7688 1.5211 1.8382 1.3760 1.5954 1.3887 1.2733 1.5279 1.4805 1.6984 2.8276 1.7947 1.8922 2.5878 3.4425 2.0493 3.8896 3.6683 4.7950 4.7838 4.6692 1.0863 1.0844 1.0858 1.0899 1.0921 1.0893 1.0926 1.0919 1.0862 1.0914 1.0956 1.1023
irintensity: 156.2515 0.0419 0.0102 0.2299 3.0417 7.2654 7.6743 12.1926 24.0377 1.1653 24.1516 17.1336 38.8476 8.4361 17.6821 13.0137 64.9358 4.2681 25.2399 29.4916 2.2403 47.7011 9.6515 1.6636 0.5510 11.9823 8.2033 54.3698 9.3050 6.7591 85.9123 2.9228 4.0247 9.2361 10.4810 1.9550 23.7777 11.0114 6.4775 8.4715 2.7651 56.5177 4.5334 2.4124 8.8035 23.0149 23.8974 40.0020 2.1837 67.3174 5.7427 24.9539 4.7874 122.9358 9.0761 31.8067 54.3511 102.9232 182.4053 41.6313 25.9308 2.7925 4.5834 14.2568 25.9804 12.4775 27.3561 3.9799 2.6831 15.2963 15.2966 27.2333
temp: 298.150 k
press: 1.00000 atm
elementType: 6 1 6 1 6 6 6 1 6 1 6 1 1 6 6 6 6 1 6 1 6 1 6 1 1 1
symmnumber: 1
zpe: 562729.6 jmol-1
zpe.correction: 0.214332 hartree
zpe.thermalcorrener: 0.224795 hartree
zpe.thermalcorrenthalpy: 0.225739 hartree
zpe.thermalcorrgfe: 0.178103 hartree
zpe.sumelectzpe: -540.238410 hartree
zpe.sumelectthermal: -540.227947 hartree
zpe.sumelectthermalent: -540.227003 hartree
zpe.sumelectthermalfe: -540.274639 hartree
dipole: -2.2856 -1.3680 -0.1462
dipole: 2.6678
quadrupole: -77.8128 -74.1552 -78.9466
quadrupole: -2.2822 5.8607 6.1993
quadrupole: -0.8413 2.8164 -1.9751 -2.2822 5.8607 6.1993
hfenergy: -540.4527424 hartree
pointgroup: C01 [X(C14H12)]
dipole: -0.8992395 -0.5382213 -0.0575032 debye
dipolederiv: -0.5952665 -0.392422 -0.1715175 -0.7210284 -0.557909 -0.1463262 -0.4930598 -0.2899916 -0.3929713 -0.0536695 0.0978524 0.0387404 0.109565 0.0473352 -0.0533497 -0.1118531 -0.0978124 0.0820279 1.1444281 0.3762453 0.1095869 -0.1113803 0.1840292 0.1637606 0.0066923 0.2576185 0.1234415 0.1081455 0.0027976 -0.0152386 -0.094698 -0.0687465 -0.1155338 0.0948278 -0.1143344 0.0167972 -0.7178232 -0.0269379 0.0681192 0.6415953 -0.1540967 0.0007264 0.6307032 0.3182576 0.1144895 -1.0905764 -0.4770355 -0.2312582 -0.8208916 -0.3276553 -0.2134379 -0.0183168 -0.0697007 -0.0873075 0.0670522 -0.2140369 -0.0629638 0.0831193 0.1935223 0.1905955 0.0447102 0.1594017 0.0564804 0.1252966 0.0787501 -0.048035 0.13445 0.1236501 0.0333379 -0.0812269 -0.0224453 -0.0076429 0.1994372 0.1500035 0.1420295 -0.2059435 -0.2145902 0.0517809 0.1161009 0.1937638 0.0734951 0.0812196 0.0070674 -0.0339642 0.0050441 0.0773466 -0.0770298 -0.1211361 -0.1114239 -0.0565239 -0.0260305 -0.1751692 0.0440363 -0.0884627 -0.198498 -0.02016 -0.0380491 -0.2372333 -0.2814057 0.0432968 0.0175612 0.0166295 0.0839913 0.0525153 -0.0864681 0.0684232 -0.0719724 -0.0025003 -0.1134964 0.0589414 -0.0707022 0.0885563 0.0817684 -0.014492 -0.0519408 0.0015904 0.0918388 -0.0356585 0.4820981 0.2359886 0.7716879 0.5914067 0.3033645 0.4311341 0.3960493 0.279333 1.13934 0.5738927 0.1712349 0.8270102 0.3373769 0.16724 -0.3765659 -0.2047762 0.0755455 -0.2972053 -0.6970997 -0.2545152 -0.1275855 -0.1790324 -0.0588322 0.0439533 -0.2589565 -0.281224 -0.1801571 -0.0756964 0.1221557 -0.7040738 -0.2517221 -0.1924014 -0.3669386 -0.0355463 -0.2253491 -0.0991796 -0.054608 -0.0781123 -0.0334677 0.0150223 -0.054433 0.1249468 0.0625266 0.0293881 0.2135257 0.0444271 0.1384438 -0.2329553 0.4845739 0.1541816 0.0751751 0.2901782 0.1108279 0.035631 0.05977 -0.0291486 0.1294611 -0.0419085 -0.0279462 -0.0412267 -0.0394378 0.0929055 0.4923766 -0.2058143 0.0759499 -0.0377597 0.2585795 0.0953579 0.3651745 0.0209926 0.0543871 0.0048622 0.0863872 -0.0647238 0.0155877 0.009524 0.0063587 -0.0358751 0.0104379 0.0734342 -0.4522772 0.2392426 0.0792671 0.2761912 -0.4376579 0.0324135 -0.0629595 0.0067428 -0.1065579 -0.0811242 0.0263544 -0.0854957 0.0498527 0.0789417 0.0083864 -0.1091436 -0.0184393 0.0501084 0.0767181 0.0523895 -0.0099564 0.0114699 -0.1013843 -0.0617032 -0.0074448 -0.0602396 0.0789291 0.011135 -0.0349607 -0.0865504 -0.0493356 -0.0023911 -0.0853901 -0.0861047 -0.0852498 0.0380532 unknown
polarizability: 262.1665651|37.3572443|168.8298743|51.0318462|54.4349919|109.5380198 unknown
InChI: InChI=1/C14H12/c1-2-4-8-13(7-3-1)11-12-14-9-5-6-10-14/h1-12H
charge 0 multiplicity 1
26 atoms
C  -1.04118981 1.13965121 0.51159407
H  -1.88796176 1.75756952 0.79842839
C  0.23645941 1.57245992 0.76629151
H  0.37726065 2.42246856 1.43225319
C  1.37667771 0.94472738 0.20069313
C  1.32245476 0.0854193 -0.96264803
C  2.59457855 0.67920467 0.86100093
H  0.68634204 0.25256274 -1.82172342
C  2.51956251 -0.65824635 -0.9824964
H  2.89441568 1.10055335 1.81348987
C  3.27798346 -0.32069224 0.14951318
H  2.82866851 -1.33263871 -1.77193242
H  4.23727549 -0.74416965 0.42064837
C  -1.32104128 -0.1051398 -0.15366372
C  -0.32464541 -1.14603519 -0.00273038
C  -2.52890921 -0.24227561 -0.84958893
C  -0.37574089 -2.46643444 -0.50797906
H  0.30764652 -1.02835888 0.86989732
C  -3.01362293 -1.29073996 -1.6375482
H  -3.17138829 0.63411402 -0.80938653
C  -1.26663899 -3.04864932 -1.38830627
H  0.42411116 -3.10794302 -0.1499664
C  -2.45168282 -2.5243729 -1.92576667
H  -3.97414756 -1.09327671 -2.10826002
H  -1.04562916 -4.07861002 -1.65993675
H  -3.01120834 -3.17233788 -2.59332678
