program: Gaussian 09
title: ts1-c3 cation [4+5] mpw
version: AM64L-G09RevD.01
method: RmPW1PW91
basis: 6-31G(d)
operation: Freq
keyword: #NGeom=AllCheck
keyword: Guess=TCheck
keyword: SCRF=Check
keyword: GenChk
keyword: RmPW1PW91/6-31G(d)
keyword: Freq
converged: YES YES YES YES
title: Mulliken charges:
elementType: C C C C C O C C C C O C H H H H H H H H H H H H
charge: 0.344022 -0.392627 -0.369658 -0.423726 0.464313 -0.477217 0.056784 0.048757 -0.421471 -0.093038 -0.488812 -0.585454 0.207716 0.190268 0.212261 0.195802 0.187774 0.194591 0.197926 0.191135 0.195702 0.189025 0.179221 0.196705
chargesum: 0.00000
title: Mulliken charges with hydrogens summed into heavy atoms:
elementType: C C C C C O C C C C O C
charge: 0.344022 -0.184911 0.032871 -0.040150 0.464313 -0.477217 0.056784 0.048757 -0.028953 0.293799 -0.488812 -0.020503
1716.lowfreq: -281.8033 -9.5126 -5.2790 -0.0005 0.0003 0.0004 10.6640 90.7321 130.4090
frequency: -281.8030 90.7213 130.4058 137.5344 152.6201 190.0375 237.2344 301.0292 342.4987 393.4496 423.4154 434.4582 493.0375 554.6730 576.2216 636.3029 659.0458 704.7270 726.3574 753.7468 810.6954 872.8426 921.5302 935.3624 968.0486 990.6117 1011.5649 1026.8293 1040.7714 1059.9025 1087.8985 1114.4118 1165.8998 1191.3448 1215.4994 1222.7847 1251.0682 1258.2552 1273.5377 1315.7709 1319.5920 1377.5586 1405.2342 1421.7288 1439.9735 1484.7079 1497.0257 1500.5070 1509.9844 1517.6636 1525.7914 1541.3075 1660.5139 1811.6978 3049.5783 3052.7677 3072.5245 3081.2048 3099.2156 3110.2225 3110.6629 3157.9281 3160.3149 3166.4517 3184.5330 3217.7299
redmass: 5.5708 6.8458 3.0909 1.1279 2.5128 2.0712 2.2812 2.5243 3.8735 4.4793 3.9539 3.7983 2.2415 3.5272 2.4788 2.8590 3.2223 2.1494 2.6009 4.0328 3.0893 2.1849 2.0593 3.1613 2.4048 2.0968 2.4685 2.2928 1.8601 1.7388 1.7244 2.2452 1.7181 1.8808 1.3915 2.9115 1.3162 1.4238 1.6258 1.3344 1.4086 1.4676 2.7206 1.6937 1.6253 2.0827 1.1360 1.1399 1.1021 1.1397 1.3427 1.1134 7.9426 11.2269 1.0658 1.0391 1.0690 1.0656 1.0656 1.0944 1.0975 1.1015 1.0963 1.1001 1.1038 1.0882
irintensity: 15.6450 3.1840 7.5831 0.4673 1.8164 0.8647 2.0365 1.4497 11.4858 0.8986 14.5395 26.3107 27.3849 17.6205 3.5078 55.8408 5.5727 12.7311 4.6394 12.7445 2.0309 2.8386 2.4539 44.9658 9.3711 2.2987 21.3907 85.9103 3.1970 2.9095 9.7610 7.6429 26.5740 23.9506 68.9194 245.2806 12.7177 10.0793 7.0304 4.6720 7.2670 14.4875 11.4388 39.2582 7.7139 59.2425 18.0842 1.1782 4.4674 1.0270 56.1830 6.0554 20.7215 403.0997 40.7358 18.4625 25.1184 6.5892 46.2367 8.5089 16.0421 15.3307 14.8837 16.5271 20.7964 2.0530
temp: 298.150 k
press: 1.00000 atm
elementType: 6 6 6 6 6 8 6 6 6 6 8 6 1 1 1 1 1 1 1 1 1 1 1 1
symmnumber: 1
zpe: 527245.5 jmol-1
zpe.correction: 0.200817 hartree
zpe.thermalcorrener: 0.210985 hartree
zpe.thermalcorrenthalpy: 0.211930 hartree
zpe.thermalcorrgfe: 0.165347 hartree
zpe.sumelectzpe: -538.297962 hartree
zpe.sumelectthermal: -538.287794 hartree
zpe.sumelectthermalent: -538.286849 hartree
zpe.sumelectthermalfe: -538.333432 hartree
dipole: 4.9937 0.9487 2.0203
dipole: 5.4698
quadrupole: -75.8062 -68.6263 -69.6037
quadrupole: -0.0942 -6.7209 -1.0057
quadrupole: -4.4608 2.7191 1.7417 -0.0942 -6.7209 -1.0057
hfenergy: -538.498779 hartree
pointgroup: C01 [X(C10H12O2)]
dipole: 1.9646679 0.3732498 0.7948607 debye
dipolederiv: 1.1416084 -0.5786954 -0.162939 -1.0629894 0.9197656 -0.0077326 -0.2125633 -0.2353603 0.2584103 -0.8952825 -0.015913 -0.1857076 -0.0866276 -0.5281881 0.1523208 -0.0183832 0.2064589 -0.0877864 -0.0330045 0.1163959 0.0108757 -0.0533829 0.0636916 -0.0056483 0.0226272 0.0714555 0.0929107 -0.0532487 0.0966519 -0.0887657 0.1249265 0.0391231 0.1413749 -0.0633598 0.0783679 -0.1379732 1.7682207 0.1798011 0.4306261 0.7030124 0.4181961 -0.1344371 0.1974985 -0.2178807 0.5927573 -1.2900882 -0.1028633 -0.3159835 -0.4944506 -0.4184075 -0.0641388 -0.5035122 -0.0032446 -0.5794866 0.1496249 -0.0569152 0.0518038 -0.4247256 0.3754795 0.0485859 0.3628306 0.2234508 0.0354115 0.1925757 0.0807871 0.0807459 0.5129014 -0.3164598 -0.0129458 0.122537 -0.1266162 -0.2190679 -0.1119407 0.0753922 0.0207366 -0.0402142 0.030442 -0.059069 0.034745 0.0307215 0.1628143 0.7886618 -0.0935693 -0.0660691 0.2696006 0.2912515 -0.089911 -0.1802919 0.0407113 0.3337134 -1.5786681 0.4334968 0.2287353 0.5139571 -0.8612782 -0.0174177 0.4299964 -0.0729453 -0.291283 0.1527893 0.078963 0.0662441 0.0835517 -0.026256 -0.0497999 -0.1083855 -0.0146999 0.084324 -0.1244695 -0.0714648 0.0219376 0.1327254 0.1348562 -0.0346134 -0.0574698 -0.0136123 -0.0265346 0.0407687 0.0093893 -0.0475156 0.0254352 -0.0389794 0.0831601 -0.0557976 0.1488926 -0.0829689 0.0313818 -0.0529625 0.0084413 -0.0012161 -0.0346129 -0.0469888 -0.0015188 -0.0773406 0.0067325 -0.0386486 -0.0666597 0.064995 -0.0817039 0.011568 0.0544108 0.0767098 0.0353169 0.0340692 0.0539983 -0.0209482 -0.0386367 -0.0036633 -0.0413843 -0.0782296 0.0004663 -0.0476913 0.004138 -0.0448816 0.0227567 -0.0397437 0.0202744 0.0424128 0.0120663 -0.0897448 -0.0154188 -0.106904 -0.0292676 -0.0577034 0.0038094 -0.0801269 -0.0275342 0.0344906 0.041682 0.0561584 0.0400533 -0.0156318 0.0078374 -0.0007693 -0.0925296 0.0401912 0.0366763 0.0863215 -0.0102551 -0.133958 -0.0989734 0.0745693 -0.0051322 0.072078 0.0090431 0.0177339 -0.0413312 0.0325837 0.0405911 -0.0781843 0.0195076 0.0692856 -0.0752651 0.0426891 -0.0012843 0.0257727 -0.0574837 0.0310322 0.0045147 -0.0589445 -0.1017881 0.0010072 -0.0151718 -0.0217652 -0.0793039 -0.1006363 -0.0272299 0.0681453 -0.018909 -0.0051857 0.0374252 -0.1104378 0.043162 0.010475 0.0690673 -0.0237653 unknown
polarizability: 144.5380842|-5.3230933|108.5207363|7.2345351|-1.2684572|82.421435 unknown
InChI: InChI=1/C10H12O2/c1-7-6-8(11)2-3-10-9(7)4-5-12-10/h6H,2-5H2,1H3
charge 0 multiplicity 1
24 atoms
C  0.61508807 -0.79328797 -0.01055427
C  -0.94933654 0.58712274 -0.84523066
C  -0.48170168 -1.5503231 0.7038693
C  -1.74248168 -0.72426908 0.99698126
C  -2.1475738 -0.07994826 -0.33363229
O  -3.16635381 -0.36709777 -0.93468371
C  -0.03798994 1.37514005 -0.03961692
C  1.04377028 0.55201177 0.14661498
C  2.5462044 0.54959174 0.24496612
C  2.81935981 -0.74522919 -0.54071089
O  1.65213329 -1.5865912 -0.36970467
C  -0.34505057 2.71743669 0.5358363
H  -0.67799763 0.39096509 -1.87839972
H  -0.05354712 -1.9823888 1.62006764
H  -0.76135207 -2.40074412 0.07146752
H  -2.54376732 -1.3544626 1.38844239
H  -1.51173043 0.05741 1.73101959
H  2.90311305 0.46392916 1.2787577
H  3.02490591 1.41688644 -0.21389622
H  2.94128542 -0.55091297 -1.61111277
H  3.67265032 -1.31827468 -0.17840412
H  -1.35438548 2.71358201 0.96847328
H  0.3652227 3.01014773 1.31334401
H  -0.35141118 3.49621731 -0.23571883
