program: Gaussian 16
title: ts1-c3 cation [4+5] mpw
version: ES64L-G16RevA.03
method: RmPW1PW91
basis: 6-31G(d)
operation: Freq
keyword: #N
keyword: Geom=AllCheck
keyword: Guess=TCheck
keyword: SCRF=Check
keyword: GenChk
keyword: RmPW1PW91/6-31G(d)
keyword: Freq
converged: YES YES YES YES
title: Mulliken charges:
elementType: C H H H C C C C H C C C H H C C C H H C H H H H C H H H H H C H C H H H H H H H
charge: -0.522438 0.204232 0.185943 0.195980 -0.001924 -0.382661 0.007810 -0.459854 0.251441 0.144608 -0.177587 -0.391005 0.221428 0.210484 -0.403728 0.196588 -0.348101 0.191615 0.223009 -0.597441 0.221687 0.213219 0.186423 0.261285 -0.537877 0.213307 0.173296 0.197881 0.176770 0.236249 -0.256423 0.197721 -0.602696 0.242096 0.213860 0.208081 0.230963 0.201376 0.226999 0.247385
chargesum: 1.00000
title: Mulliken charges with hydrogens summed into heavy atoms:
elementType: C C C C C C C C C C C C C C C
charge: 0.063717 -0.001924 0.105622 0.255195 0.027836 0.144608 -0.000818 0.040907 0.028611 0.196588 0.066523 0.023888 0.046608 -0.058702 0.061342
1716.lowfreq: -113.9707 -8.0887 -5.3075 -0.0005 0.0006 0.0007 7.3557 56.7916 78.6346
frequency: -113.9587 56.7730 78.6331 85.3193 97.2598 149.3581 155.3433 169.9089 204.1496 222.0943 252.4265 266.0077 281.0014 299.8590 305.2190 323.3777 334.2457 350.9740 382.2851 408.1956 420.2852 457.5671 462.0831 493.4329 518.2170 547.5678 551.4661 620.9467 742.7381 771.6859 779.5233 823.3132 833.2466 853.5613 878.3884 918.9868 926.4813 933.2387 954.4787 958.4264 967.5763 980.8428 993.2546 1018.7293 1027.6250 1035.5414 1044.1530 1060.5942 1072.2239 1083.5759 1109.7716 1143.4362 1165.7238 1173.8896 1189.3137 1198.6608 1209.8168 1232.2711 1248.0917 1254.2024 1273.1747 1284.9223 1316.0642 1327.0508 1343.5021 1361.2611 1371.8282 1411.3875 1415.7873 1420.5790 1438.5946 1441.5965 1457.7203 1462.5627 1466.1345 1479.6430 1491.1335 1499.8827 1503.6464 1509.4340 1514.0228 1514.9555 1523.1462 1527.4650 1537.4654 1538.9329 1544.6878 1643.3995 1768.3972 2963.4703 3007.2404 3061.2285 3069.4173 3072.0516 3073.9862 3077.2381 3080.2565 3114.5520 3119.1144 3120.7311 3135.7260 3143.6493 3148.5544 3148.8138 3150.4848 3157.2331 3159.3296 3163.8666 3167.0817 3176.9227 3179.4716 3186.2806 3187.2127 3235.6212
redmass: 4.6266 2.2409 1.6638 2.8820 1.7808 1.9412 1.3979 2.2935 2.8579 1.0851 1.9925 1.8208 1.8797 1.9378 2.8543 2.2801 3.0950 1.9938 1.9298 2.1954 2.2358 3.1938 2.3972 2.7415 2.5464 2.4725 2.7524 2.4986 1.4404 2.4870 2.3670 2.6330 1.6807 1.5394 1.5733 1.9479 1.9026 1.8358 1.4935 1.8977 1.4522 1.5310 1.6122 1.6293 1.4153 1.7093 1.7499 1.3534 1.6567 1.6747 1.8328 2.1854 1.7560 1.4663 1.5716 1.3281 1.7620 1.9856 2.0712 1.5701 1.9572 1.8013 1.8929 1.3284 1.3326 1.5461 1.5063 1.2876 1.1155 1.2239 1.4184 1.2837 1.2830 1.2206 1.2483 1.5530 1.0748 1.1135 1.0963 1.0698 1.0642 1.0471 1.0864 1.0749 1.0894 1.0779 1.0555 4.8813 6.9590 1.0696 1.0686 1.0435 1.0591 1.0643 1.0502 1.0365 1.0391 1.0875 1.0969 1.0619 1.0965 1.0997 1.0893 1.0920 1.1015 1.1025 1.0912 1.1026 1.1017 1.1024 1.0871 1.0981 1.1031 1.0875
irintensity: 48.0460 0.3064 0.1696 1.2697 2.3655 4.9355 5.3626 7.2140 1.4794 0.1554 0.3350 0.1960 6.8061 0.2216 20.3963 0.2486 12.7546 1.4453 1.1279 2.9747 2.9692 7.1003 3.0190 3.7695 17.2747 2.5619 3.0578 2.2769 43.2494 1.9665 2.4341 2.4391 28.4436 15.8741 19.5074 2.1028 127.7011 41.7061 3.3129 18.7705 6.1507 15.9668 33.4107 32.8711 4.7368 3.5425 8.8454 11.8417 2.5155 19.9319 11.8108 12.4169 9.5615 16.2871 17.9118 12.6628 28.7457 22.1369 35.4154 1.7496 30.8343 0.9456 12.8304 4.0849 6.0628 5.4382 0.2485 9.9996 6.6129 8.2173 26.6998 30.2424 25.1906 12.6656 2.8154 32.6067 13.6006 2.5262 14.1965 7.0789 7.2998 0.6750 10.6840 18.8715 16.1978 0.2315 11.4438 173.8338 9.0475 25.2164 6.7196 11.0666 3.9435 3.5360 0.2689 21.7657 3.5742 3.0667 9.9045 15.7197 5.3879 5.7351 5.5477 3.0746 23.3090 19.9761 4.4708 1.0434 12.4196 11.7319 12.0673 8.1931 6.3352 12.1605
temp: 298.150 k
press: 1.00000 atm
elementType: 6 1 1 1 6 6 6 6 1 6 6 6 1 1 6 6 6 1 1 6 1 1 1 1 6 1 1 1 1 1 6 1 6 1 1 1 1 1 1 1
symmnumber: 1
zpe: 966374.9 jmol-1
zpe.correction: 0.368073 hartree
zpe.thermalcorrener: 0.384186 hartree
zpe.thermalcorrenthalpy: 0.385131 hartree
zpe.thermalcorrgfe: 0.326330 hartree
zpe.sumelectzpe: -585.837131 hartree
zpe.sumelectthermal: -585.821017 hartree
zpe.sumelectthermalent: -585.820073 hartree
zpe.sumelectthermalfe: -585.878873 hartree
dipole: -0.5351 -0.9444 -0.2950
dipole: 1.1248
quadrupole: -68.7626 -71.8720 -85.0261
quadrupole: 3.6739 2.6281 0.2011
quadrupole: 6.4577 3.3482 -9.8059 3.6739 2.6281 0.2011
hfenergy: -586.2052034 hartree
pointgroup: C01 [X(C15H25)]
dipole: -0.1665227 -0.3742416 -0.1280927 debye
polarizability: 188.1943352|16.02352|179.2128963|4.2379304|2.4604903|125.1178162 unknown
InChI: InChI=1/C15H25/c1-13-7-5-8-14(2)10-12-15(3,4)11-6-9-13/h6-7,10H,5,8-9,11-12H2,1-4H3
charge 1 multiplicity 1
40 atoms
C  -3.88983373 0.28068632 -0.67423262
H  -4.48219061 1.00190876 -0.10410432
H  -3.68684748 0.71832534 -1.65696751
H  -4.50796474 -0.61017123 -0.82025408
C  -2.59652799 -0.05361941 0.07190883
C  -1.72709564 -0.9697635 -0.81012949
C  -0.44115648 -1.37729825 -0.2487434
C  0.68491014 -1.9348315 -1.02838966
H  0.59177281 -3.03331703 -0.95749322
C  1.95886948 -1.4411539 -0.36136668
C  2.39150835 -0.2491842 -0.78216606
C  3.14890904 0.75664729 0.01152693
H  3.93720023 0.33314361 0.63750671
H  3.61381862 1.50759856 -0.6312726
C  2.08042623 1.4151724 0.95522369
C  0.7481104 1.63239764 0.30136937
C  -1.77115417 1.23604144 0.29359557
H  -1.77557561 1.82084414 -0.63042081
H  -2.28824588 1.84694688 1.04547249
C  2.46288965 -2.21044384 0.81895708
H  2.76813931 -3.21741938 0.51149597
H  3.32618552 -1.7313963 1.28281174
H  1.69913488 -2.34185971 1.59627752
H  -2.25722667 -1.93871463 -0.92584888
C  -2.94511094 -0.72503451 1.40454162
H  -3.60358335 -0.07483063 1.9869576
H  -2.07399613 -0.93574262 2.03317375
H  -3.47756839 -1.6677634 1.24385067
H  1.9062928 0.15950153 -1.66885794
H  0.62547309 -1.66370733 -2.08537702
C  -0.37030452 0.97601726 0.74959186
H  -0.25733542 0.43778806 1.68968145
C  0.71895305 2.63317106 -0.81183203
H  0.48915808 3.62365104 -0.39747671
H  1.68934041 2.71870323 -1.3059129
H  -0.03943526 2.42097532 -1.56742363
H  2.47028897 2.3845456 1.29368871
H  1.96009116 0.77988698 1.83653267
H  -1.60772289 -0.57866254 -1.82672346
H  -0.41817353 -1.60886855 0.81304878
