program: Gaussian 16
title: phenonium ion with F
version: ES64L-G16RevA.03
frameworkgroup: C1[X(CH2N2O2)]
method: RmPW1PW91
basis: 6-31G(d)
operation: Freq
keyword: #N
keyword: Geom=AllCheck
keyword: Guess=TCheck
keyword: SCRF=Check
keyword: GenChk
keyword: RmPW1PW91/6-31G(d)
keyword: Freq
converged: YES YES YES YES
title: Mulliken charges:
elementType: C O N O N H H
charge: 0.352917 -0.455266 0.293706 -0.044823 -0.632834 0.326822 0.159478
chargesum: -0.00000
title: Mulliken charges with hydrogens summed into heavy atoms:
elementType: C O N O N
charge: 0.512394 -0.455266 0.293706 -0.044823 -0.306011
1716.lowfreq: -185.0403 -3.1753 0.0006 0.0012 0.0013 2.2078 5.3113 238.0992 364.4993
frequency: -185.0403 238.0992 364.4993 436.6419 598.8154 682.8823 765.9485 1030.3184 1119.4113 1326.2798 1427.7759 1643.4973 2043.8837 3062.6868 3570.9893
redmass: 5.1471 3.1599 6.1324 9.5498 5.8872 1.3978 4.5965 1.5933 1.3273 1.2273 6.9614 6.0537 14.4823 1.0894 1.0781
irintensity: 40.5223 36.9939 53.2444 10.7454 123.2692 65.4796 28.6909 1.6106 71.7685 61.7294 37.3165 123.0906 786.0905 86.0341 12.8773
temp: 298.150 k
press: 1.00000 atm
elementType: 6 8 7 8 7 1 1
symmnumber: 1
zpe: 109528.5 jmol-1
zpe.correction: 0.041717 hartree
zpe.thermalcorrener: 0.046119 hartree
zpe.thermalcorrenthalpy: 0.047063 hartree
zpe.thermalcorrgfe: 0.014410 hartree
zpe.sumelectzpe: -299.004408 hartree
zpe.sumelectthermal: -299.000006 hartree
zpe.sumelectthermalent: -298.999062 hartree
zpe.sumelectthermalfe: -299.031714 hartree
dipole: 0.6974 1.6343 0.7549
dipole: 1.9306
quadrupole: -21.0958 -28.1182 -27.9717
quadrupole: 2.1311 -0.0514 0.8310
quadrupole: 4.6327 -2.3896 -2.2431 2.1311 -0.0514 0.8310
hfenergy: -299.0461248 hartree
pointgroup: C01 [X(C1H2N2O2)]
dipole: 0.2743491 0.6429717 0.2970269 debye
dipolederiv: 0.8336696 -0.0896594 0.0088577 0.0561364 0.9887377 -0.0791788 0.0158811 -0.0499586 0.2307149 -0.8982086 -0.0391632 0.0346119 0.2061756 -0.9519398 -0.0033249 0.1950781 -0.1051155 -0.3602135 2.534822 0.0246016 0.0670611 -0.1096558 0.5466861 0.0170435 1.2305555 0.0040184 0.3111547 -1.6582038 -0.0020008 -0.0868907 0.083016 0.0245317 -0.0029342 -1.5099681 -0.000283 -0.0678256 -0.5852501 0.2777311 0.0014142 -0.3045676 -0.9380423 0.1046642 0.0936414 0.214349 -0.5018181 0.0096864 -0.2286184 -0.023032 0.0331842 0.2368339 -0.0357282 0.0612476 -0.0668296 0.2762337 -0.2365154 0.057109 -0.0020222 0.0357111 0.0931927 -0.0005416 -0.0864356 0.0038192 0.1117539 unknown
polarizability: 56.2360371|1.1116598|34.573739|-0.1912977|0.1050383|16.9554435 unknown
InChI: InChI=1/CH2NO.NO/c2-1-3;1-2/h1-2H;
charge 0 multiplicity 1
7 atoms
C  1.28614872 -0.13321234 -0.0421378
O  0.51496984 -1.14028665 -0.04610707
N  -0.94355264 0.05027177 0.48178968
O  -1.77495227 0.08496396 -0.2797127
N  0.75092553 1.05025634 -0.09535041
H  1.33947932 1.84211064 0.14734592
H  2.37161051 -0.30579871 0.01746337
