program: Gaussian 16
title: ts1-c3 cation [4+5] mpw
version: ES64L-G16RevA.03
method: RmPW1PW91
basis: 6-31G(d)
operation: Freq
keyword: #N
keyword: Geom=AllCheck
keyword: Guess=TCheck
keyword: SCRF=Check
keyword: GenChk
keyword: RmPW1PW91/6-31G(d)Freq
converged: YES YES YES YES
title: Mulliken charges:
elementType: O C C C C C O H H H H
charge: -0.363688 0.177609 -0.257700 -0.090877 -0.330791 0.453864 -0.354005 0.145396 0.200392 0.186573 0.233227
chargesum: -0.00000
title: Mulliken charges with hydrogens summed into heavy atoms:
elementType: O C C C C C O
charge: -0.363688 0.323005 -0.057308 0.095696 -0.097564 0.453864 -0.354005
chargesum: 0.00000
1716.lowfreq: -226.5422 -3.5286 -1.5698 -0.0003 0.0008 0.0012 2.8505 54.6905 103.8657
frequency: -226.5422 54.6905 103.8657 195.5869 328.6478 493.9368 526.1834 541.0628 642.4744 715.2069 756.3744 922.5311 973.4845 989.4464 1065.8627 1168.6049 1239.5297 1416.6014 1442.3958 1472.6469 1718.5260 1839.9754 2256.0462 2933.6849 3201.3777 3218.2532 3228.9506
redmass: 2.2702 3.6471 9.1190 6.5256 3.1577 2.1074 3.6637 2.4124 2.5090 2.6803 3.8223 3.7266 1.5290 1.9666 2.3491 1.4426 1.1125 1.2455 1.3922 3.4558 7.5326 11.1924 12.6196 1.0824 1.0836 1.0921 1.0885
irintensity: 9.3656 2.1157 0.0522 3.4936 4.4589 19.1148 1.5496 47.5368 31.2849 19.7744 8.8166 33.2560 13.5980 4.4982 10.2616 0.8043 0.9091 7.8788 20.5870 32.1367 54.4338 127.8409 710.4041 117.1385 8.3095 10.1760 3.7959
temp: 298.150 k
press: 1.00000 atm
elementType: 8 6 6 6 6 6 8 1 1 1 1
symmnumber: 1
zpe: 200051.2 jmol-1
zpe.correction: 0.076195 hartree
zpe.thermalcorrener: 0.082712 hartree
zpe.thermalcorrenthalpy: 0.083657 hartree
zpe.thermalcorrgfe: 0.044745 hartree
zpe.sumelectzpe: -343.136631 hartree
zpe.sumelectthermal: -343.130114 hartree
zpe.sumelectthermalent: -343.129170 hartree
zpe.sumelectthermalfe: -343.168081 hartree
dipole: -0.0071 3.3844 1.2413
dipole: 3.6049
quadrupole: -36.1170 -40.2975 -40.4190
quadrupole: -0.5961 1.2811 -2.3919
quadrupole: 2.8275 -1.3530 -1.4745 -0.5961 1.2811 -2.3919
hfenergy: -343.2128261 hartree
pointgroup: C01 [X(C5H4O2)]
dipole: -0.0028128 1.3315397 0.4883505 debye
dipolederiv: -0.2994817 0.0169579 -0.0191622 0.1964859 -0.7691105 -0.1607977 -0.0203246 -0.1700976 -0.624167 0.1117174 0.0182276 0.0428941 -0.2858584 1.0354826 0.0592539 0.1302554 -0.0383834 0.9962926 -0.2960741 -0.0310111 -0.0405634 0.172446 -0.3041036 -0.0092121 -0.0846065 0.0938218 -0.3557115 0.8950158 0.0352328 0.0383538 0.1480777 0.1606572 -0.0473581 -0.0355662 -0.0884447 -0.023667 -0.6713336 -0.155825 -0.0568165 -0.6954212 -0.5768144 -0.0100969 0.0082805 0.0212217 -0.3937862 0.9056123 0.636797 0.0478326 1.4092779 1.5396844 0.0953366 0.0220084 0.0877972 0.3642066 -0.7563346 -0.4739132 -0.0340775 -1.012554 -1.0515135 -0.0651063 -0.0246837 -0.05607 -0.1960777 0.0759126 -0.0098804 -0.0076828 0.080402 -0.0583964 0.0671344 -0.0478897 0.0764708 -0.2486518 -0.0287462 -0.0079557 0.011437 0.0042413 0.0260633 0.0335773 0.0311907 0.0293681 0.1489115 0.02271 -0.0096915 0.0057404 -0.0389349 -0.084673 0.0443752 -0.0335405 0.0461875 0.1213423 0.041002 -0.0189385 0.0120447 0.0218377 0.0827238 -0.0071063 0.0548762 -0.0018714 0.2113081 unknown
polarizability: 66.1116732|4.4278091|63.3049432|1.7800114|-0.4821263|30.6673593 unknown
InChI: InChI=1/C5H4O2/c6-4-2-1-3-5-7/h1-4H
charge 0 multiplicity 1
11 atoms
O  1.26639597 -1.65487029 -0.34024094
C  1.34846573 -0.73274251 0.43717487
C  1.44809737 0.69956776 0.03622574
C  0.40174584 1.52230097 -0.1174237
C  -1.01788205 1.21998466 0.00726395
C  -1.58285383 0.02234864 -0.04585087
O  -2.1289568 -1.00258259 -0.09583319
H  1.36421496 -0.92494707 1.53229339
H  2.45367651 1.07974609 -0.12471345
H  0.60264617 2.55918444 -0.37237846
H  -1.72752586 2.03488891 0.11124067
