program: Orca
programVersion: 5.0.2
elementType: Cl Cl F F F F O O C C C C C C C C C C C C C C C H H H H H H H H H H H H
charge: 0
multiplicity: 1
keywords: wb97x-d3
keywords: def2-TZVPP
keywords: def2/J RIJCOSX
keywords: DEFGRID2
keywords: scfconv7
keywords: smallprint printgap noloewdin
keywords: NOSOSCF
formula: C15H12Cl2F4O2
InChI: InChI=1/C15H12Cl2F4O2/c1-15(2)7(3-10(16)17)11(15)14(22)23-5-6-12(20)8(18)4-9(19)13(6)21/h3-4,7,11H,5H2,1-2H3
35 atoms
Cl -3.798132 2.387883 0.601703
Cl -6.143744 1.013314 -0.360947
F  1.619796 1.710604 0.669204
F  3.5681 -1.468514 -2.194409
F  5.395863 -2.024273 -0.322777
F  3.45273 1.136018 2.547483
O  0.171124 0.143438 -1.34407
O  0.54383 -2.035661 -1.660219
C  -1.758623 -1.532283 0.738584
C  -1.535149 -1.369514 -0.7434
C  -2.308222 -0.32273 0.016026
C  -0.610146 -1.296354 1.68757
C  -2.687357 -2.635091 1.180472
C  -3.745327 -0.174535 -0.242568
C  -0.174929 -1.138671 -1.287833
C  -4.454237 0.927415 -0.033241
C  1.47909 0.462113 -1.825618
C  2.53261 0.130829 -0.807954
C  2.542609 0.781759 0.416975
C  3.515473 -0.819055 -1.032455
C  4.466739 -1.103219 -0.068469
C  3.486344 0.490846 1.381735
C  4.462224 -0.45461 1.146633
H  -2.110012 -2.048062 -1.36653
H  -1.777656 0.597878 0.227206
H  -0.989301 -1.110821 2.693835
H  0.03897 -2.172594 1.735241
H  0.002165 -0.438517 1.411006
H  -3.464889 -2.853472 0.449913
H  -2.125494 -3.556012 1.344758
H  -3.173127 -2.372408 2.121871
H  -4.278993 -1.029665 -0.640723
H  1.455521 1.533664 -2.013672
H  1.670578 -0.031422 -2.776846
H  5.206896 -0.681983 1.898343
elementType: Cl F O C H
totalener: -2049.15482180 hartree
nucrepener: 2268.95209915 hartree
electener: -4318.10692095 hartree
oneelecener: -7334.17270560 hartree
twoeener: 3016.06578465 hartree
cpcmener: -0.02731729 hartree
kineticenergy: 2043.54052104 hartree
xcener: -143.164884378994 hartree
chargesum: -0.0000000
charge: -0.059770 -0.063210 -0.204384 -0.203731 -0.204242 -0.204188 -0.265015 -0.477365 0.083104 -0.101767 0.049386 -0.262829 -0.270347 -0.217003 0.425318 0.038427 0.046315 -0.118096 0.166020 0.267630 0.196456 0.222270 -0.172639 0.110070 0.078069 0.102532 0.103912 0.086382 0.092051 0.098158 0.099674 0.135727 0.143045 0.123617 0.156423
qa: -0.0598 -0.0632 -0.2044 -0.2037 -0.2042 -0.2042 -0.2650 -0.4774 0.0831 -0.1018 0.0494 -0.2628 -0.2703 -0.2170 0.4253 0.0384 0.0463 -0.1181 0.1660 0.2676 0.1965 0.2223 -0.1726 0.1101 0.0781 0.1025 0.1039 0.0864 0.0921 0.0982 0.0997 0.1357 0.1430 0.1236 0.1564
va: 1.2658 1.2422 1.0920 1.0944 1.0837 1.0862 2.1423 2.0265 3.7608 3.8378 3.8309 3.9158 3.8968 3.8881 4.1910 4.2005 3.8407 3.5558 3.8932 3.8874 3.9534 3.9573 3.8751 1.0235 1.0443 1.0020 1.0022 0.9980 1.0047 1.0017 1.0010 1.0149 0.9949 1.0170 0.9973
dispcorr: -0.018563128 hartree
energy: -2049.173384925144
dipole: -8.32355 8.58831 0.26476 -16.84718 16.85169 0.00451 3.94956 -3.53794 0.41161
magnitude: 0.48943 au
magnitude: 1.24404 debye
