program: Orca
programVersion: 5.0.2
elementType: Cl Cl F F F F O O C C C C C C C C C C C C C C C H H H H H H H H H H H H
charge: 0
multiplicity: 1
keywords: wb97x-d3
keywords: def2-TZVPP
keywords: def2/J RIJCOSX
keywords: DEFGRID2
keywords: scfconv7
keywords: smallprint printgap noloewdin
keywords: NOSOSCF
formula: C15H12Cl2F4O2
InChI: InChI=1/C15H12Cl2F4O2/c1-15(2)7(3-10(16)17)11(15)14(22)23-5-6-12(20)8(18)4-9(19)13(6)21/h3-4,7,11H,5H2,1-2H3
35 atoms
Cl -2.786571 1.311104 2.114536
Cl -5.46827 1.532915 1.074413
F  2.695889 2.48384 -0.839408
F  2.514547 -2.191729 -0.379836
F  4.070056 -2.034788 1.800062
F  4.268801 2.631259 1.315822
O  0.372254 -0.243586 -1.427388
O  -0.313697 -0.499291 -3.533531
C  -2.1572 -1.992205 -0.858545
C  -1.881514 -0.838692 -1.801299
C  -2.288492 -0.577617 -0.364405
C  -1.02716 -2.822288 -0.301468
C  -3.391925 -2.80731 -1.156835
C  -3.597907 0.039713 -0.123665
C  -0.546839 -0.515728 -2.345551
C  -3.897782 0.849749 0.88333
C  1.702758 0.018583 -1.890486
C  2.569937 0.136966 -0.676251
C  3.028204 1.357894 -0.209021
C  2.939135 -0.996838 0.032195
C  3.741221 -0.917011 1.153367
C  3.84003 1.436813 0.909027
C  4.201945 0.303071 1.603089
H  -2.654267 -0.68521 -2.546301
H  -1.492886 -0.257701 0.298101
H  -0.649649 -3.519591 -1.051962
H  -0.194464 -2.226085 0.063495
H  -1.395203 -3.412015 0.539997
H  -3.804353 -3.225816 -0.237027
H  -4.17595 -2.232464 -1.647161
H  -3.138628 -3.640146 -1.815037
H  -4.392362 -0.169778 -0.829865
H  1.721467 0.934063 -2.480281
H  2.051425 -0.79373 -2.529874
H  4.831793 0.369138 2.480775
elementType: Cl F O C H
totalener: -2049.15557199 hartree
nucrepener: 2242.43770112 hartree
electener: -4291.59327311 hartree
oneelecener: -7280.54975592 hartree
twoeener: 2988.95648281 hartree
cpcmener: -0.02551949 hartree
kineticenergy: 2043.53301519 hartree
xcener: -143.163218817350 hartree
chargesum: 0.0000000
charge: -0.058481 -0.062756 -0.202602 -0.203765 -0.202959 -0.203102 -0.269840 -0.489899 0.088019 -0.090879 0.059807 -0.265287 -0.268316 -0.219891 0.433415 0.042180 0.067672 -0.194934 0.276595 0.249316 0.189563 0.180968 -0.150488 0.098456 0.083052 0.104426 0.081929 0.099029 0.099509 0.092336 0.098636 0.131808 0.120766 0.129436 0.156282
qa: -0.0585 -0.0628 -0.2026 -0.2038 -0.2030 -0.2031 -0.2698 -0.4899 0.0880 -0.0909 0.0598 -0.2653 -0.2683 -0.2199 0.4334 0.0422 0.0677 -0.1949 0.2766 0.2493 0.1896 0.1810 -0.1505 0.0985 0.0831 0.1044 0.0819 0.0990 0.0995 0.0923 0.0986 0.1318 0.1208 0.1294 0.1563
va: 1.2675 1.2423 1.1001 1.0961 1.0869 1.0847 2.1342 2.0087 3.7285 3.8734 3.8285 3.9137 3.9111 3.8888 4.1354 4.2092 3.8066 3.7094 3.8763 3.8565 3.9901 3.9646 3.8557 1.0305 1.0398 0.9992 1.0143 1.0014 1.0009 1.0057 1.0004 1.0188 1.0112 1.0023 0.9973
dispcorr: -0.017256145 hartree
energy: -2049.172828131995
dipole: -13.82761 14.22028 0.39268 -22.32957 21.40003 -0.92955 -15.23751 15.72800 0.49049
magnitude: 1.12198 au
magnitude: 2.85184 debye
