program: Orca
programVersion: 5.0.2
elementType: Cl Cl F F F F O O C C C C C C C C C C C C C C C H H H H H H H H H H H H
charge: 0
multiplicity: 1
keywords: wb97x-d3
keywords: def2-TZVPP
keywords: def2/J RIJCOSX
keywords: DEFGRID2
keywords: scfconv7
keywords: smallprint printgap noloewdin
keywords: NOSOSCF
formula: C15H12Cl2F4O2
InChI: InChI=1/C15H12Cl2F4O2/c1-15(2)7(3-10(16)17)11(15)14(22)23-5-6-12(20)8(18)4-9(19)13(6)21/h3-4,7,11H,5H2,1-2H3
35 atoms
Cl -2.637498 2.233678 0.829578
Cl -5.27404 1.97115 -0.309876
F  2.647967 -1.977404 1.126018
F  2.448769 1.291317 -2.248718
F  3.820967 2.973927 -0.697484
F  4.033571 -0.29267 2.671716
O  0.373054 -1.218164 -1.02042
O  -0.236393 -2.928033 -2.317056
C  -2.235723 -2.176698 0.488674
C  -1.878568 -1.902517 -0.957154
C  -2.264343 -0.76609 -0.036432
C  -1.162841 -2.52107 1.492015
C  -3.52673 -2.920194 0.72568
C  -3.5232 -0.056029 -0.290822
C  -0.514674 -2.079722 -1.499797
C  -3.768359 1.207429 0.032621
C  1.73284 -1.350627 -1.452834
C  2.528355 -0.40108 -0.613566
C  2.939152 -0.762753 0.659741
C  2.838103 0.878867 -1.043237
C  3.546836 1.752683 -0.239443
C  3.648689 0.1090 1.461385
C  3.959265 1.378266 1.020788
H  -2.634239 -2.221844 -1.666571
H  -1.44694 -0.146571 0.311697
H  -0.254259 -1.934406 1.373466
H  -1.535835 -2.341387 2.501716
H  -0.895744 -3.577127 1.423552
H  -3.955035 -2.642853 1.69038
H  -4.275469 -2.729749 -0.041711
H  -3.342541 -3.995546 0.741998
H  -4.319027 -0.596365 -0.789898
H  1.815407 -1.110976 -2.512469
H  2.082869 -2.374105 -1.317554
H  4.511977 2.064256 1.649795
elementType: Cl F O C H
totalener: -2049.15559374 hartree
nucrepener: 2251.98999869 hartree
electener: -4301.14559243 hartree
oneelecener: -7299.66373132 hartree
twoeener: 2998.51813889 hartree
cpcmener: -0.02576357 hartree
kineticenergy: 2043.54616033 hartree
xcener: -143.165117956024 hartree
chargesum: 0.0000000
charge: -0.059506 -0.062258 -0.205187 -0.202436 -0.203486 -0.203164 -0.263621 -0.488904 0.080025 -0.100699 0.062326 -0.253280 -0.266445 -0.221093 0.433932 0.041022 0.063408 -0.201366 0.262925 0.269643 0.183088 0.190015 -0.150468 0.103107 0.081310 0.079350 0.098919 0.101595 0.099983 0.091831 0.098446 0.134666 0.124751 0.125309 0.156264
qa: -0.0595 -0.0623 -0.2052 -0.2024 -0.2035 -0.2032 -0.2636 -0.4889 0.0800 -0.1007 0.0623 -0.2533 -0.2664 -0.2211 0.4339 0.0410 0.0634 -0.2014 0.2629 0.2696 0.1831 0.1900 -0.1505 0.1031 0.0813 0.0793 0.0989 0.1016 0.1000 0.0918 0.0984 0.1347 0.1248 0.1253 0.1563
va: 1.2659 1.2433 1.0941 1.1002 1.0844 1.0863 2.1336 2.0089 3.7532 3.8836 3.8196 3.9109 3.9053 3.8901 4.1391 4.2063 3.8126 3.7215 3.8528 3.8877 3.9624 3.9812 3.8541 1.0289 1.0397 1.0141 1.0014 1.0007 1.0010 1.0053 1.0013 1.0159 1.0070 1.0064 0.9970
dispcorr: -0.017283122 hartree
energy: -2049.172876860437
dipole: -14.49918 14.78770 0.28852 -27.60592 27.30368 -0.30224 1.86374 -1.01827 0.84547
magnitude: 0.94309 au
magnitude: 2.39714 debye
