program: Orca
programVersion: 5.0.2
elementType: Cl Cl F F F F O O C C C C C C C C C C C C C C C H H H H H H H H H H H H
charge: 0
multiplicity: 1
keywords: wb97x-d3
keywords: def2-TZVPP
keywords: def2/J RIJCOSX
keywords: DEFGRID2
keywords: scfconv7
keywords: smallprint printgap noloewdin
keywords: NOSOSCF
formula: C15H12Cl2F4O2
InChI: InChI=1/C15H12Cl2F4O2/c1-15(2)7(3-10(16)17)11(15)14(22)23-5-6-12(20)8(18)4-9(19)13(6)21/h3-4,7,11H,5H2,1-2H3
35 atoms
Cl -4.305129 -1.155012 1.982387
Cl -5.091143 1.618586 2.049558
F  3.093623 1.891289 -1.791847
F  2.772471 -2.197341 0.514991
F  4.217712 -1.179065 2.508979
F  4.558057 2.900158 0.209198
O  0.793304 -0.09266 -1.876444
O  -0.099866 -1.753378 -0.667124
C  -2.653785 -0.392359 -2.091778
C  -1.446425 0.113141 -1.328981
C  -2.680807 -0.345099 -0.587979
C  -2.626267 -1.751093 -2.74559
C  -3.416183 0.636242 -2.890033
C  -3.479666 0.642846 0.145936
C  -0.210278 -0.691706 -1.232341
C  -4.193021 0.393359 1.236914
C  2.086043 -0.705985 -1.856258
C  2.893193 -0.18059 -0.704448
C  3.363401 1.124158 -0.735283
C  3.19315 -0.937263 0.417018
C  3.945339 -0.411774 1.453258
C  4.116023 1.646002 0.296809
C  4.413607 0.882604 1.406306
H  -1.282143 1.182984 -1.399519
H  -2.58867 -1.314329 -0.111385
H  -3.646789 -2.088878 -2.933017
H  -2.112373 -1.704965 -3.70742
H  -2.139252 -2.510943 -2.137348
H  -3.353536 1.63757 -2.466164
H  -3.024406 0.688157 -3.907029
H  -4.470933 0.36295 -2.954841
H  -3.488833 1.66295 -0.219293
H  2.553423 -0.432754 -2.800277
H  2.01325 -1.790913 -1.833841
H  5.002091 1.289058 2.218845
elementType: Cl F O C H
totalener: -2049.15634835 hartree
nucrepener: 2206.75562775 hartree
electener: -4255.91197610 hartree
oneelecener: -7210.10642956 hartree
twoeener: 2954.19445346 hartree
cpcmener: -0.02657552 hartree
kineticenergy: 2043.53580378 hartree
xcener: -143.163864369165 hartree
chargesum: -0.0000000
charge: -0.058697 -0.062698 -0.202789 -0.203052 -0.204036 -0.204160 -0.277567 -0.481554 0.083721 -0.090320 0.028816 -0.259501 -0.263790 -0.204230 0.429404 0.039541 0.070533 -0.184114 0.227422 0.291029 0.187078 0.187787 -0.155102 0.103818 0.072991 0.099752 0.101275 0.090962 0.092223 0.098237 0.101264 0.134354 0.139373 0.115457 0.156573
qa: -0.0587 -0.0627 -0.2028 -0.2031 -0.2040 -0.2042 -0.2776 -0.4816 0.0837 -0.0903 0.0288 -0.2595 -0.2638 -0.2042 0.4294 0.0395 0.0705 -0.1841 0.2274 0.2910 0.1871 0.1878 -0.1551 0.1038 0.0730 0.0998 0.1013 0.0910 0.0922 0.0982 0.1013 0.1344 0.1394 0.1155 0.1566
va: 1.2666 1.2423 1.0990 1.0950 1.0839 1.0841 2.1320 2.0292 3.7600 3.8118 3.8585 3.9054 3.9043 3.8973 4.1844 4.2045 3.8065 3.6336 3.9350 3.8407 3.9695 3.9556 3.8541 1.0289 1.0541 1.0002 1.0002 1.0168 1.0053 1.0018 1.0008 1.0163 0.9971 1.0273 0.9970
dispcorr: -0.016460399 hartree
energy: -2049.172808747464
dipole: -16.18483 16.74306 0.55823 -4.93833 5.85353 0.91520 -27.61427 25.96156 -1.65271
magnitude: 1.96994 au
magnitude: 5.00718 debye
