program: Orca
programVersion: 5.0.2
elementType: Cl Cl F F F F O O C C C C C C C C C C C C C C C H H H H H H H H H H H H
charge: 0
multiplicity: 1
keywords: wb97x-d3
keywords: def2-TZVPP
keywords: def2/J RIJCOSX
keywords: DEFGRID2
keywords: scfconv7
keywords: smallprint printgap noloewdin
keywords: NOSOSCF
formula: C15H12Cl2F4O2
InChI: InChI=1/C15H12Cl2F4O2/c1-15(2)7(3-10(16)17)11(15)14(22)23-5-6-12(20)8(18)4-9(19)13(6)21/h3-4,7,11H,5H2,1-2H3
35 atoms
Cl -0.998827 1.699866 -0.019439
Cl -3.61239 2.931449 -0.087162
F  1.272179 0.058375 2.310659
F  3.336073 -1.499284 -1.620416
F  4.356873 0.924889 -2.042242
F  2.331339 2.485884 1.89418
O  0.20739 -2.020256 0.488242
O  0.366011 -1.875157 -1.733077
C  -2.858247 -2.258527 -0.050683
C  -1.738115 -1.494233 -0.740332
C  -2.444874 -0.926874 0.472824
C  -2.563869 -3.488372 0.77076
C  -4.132419 -2.36845 -0.852129
C  -3.256628 0.297627 0.303467
C  -0.30313 -1.824097 -0.725953
C  -2.70354 1.48477 0.100259
C  1.628194 -2.129033 0.60055
C  2.27063 -0.792622 0.359298
C  2.034696 0.257979 1.235079
C  3.067347 -0.534656 -0.743676
C  3.604912 0.721852 -0.960261
C  2.576987 1.50976 1.020718
C  3.366768 1.756508 -0.082969
H  -2.02644 -1.065926 -1.69378
H  -1.865083 -0.94873 1.391379
H  -2.376651 -4.348833 0.126489
H  -1.71022 -3.369558 1.43387
H  -3.428116 -3.726617 1.392854
H  -4.093125 -3.235965 -1.512595
H  -4.990522 -2.494941 -0.189862
H  -4.31462 -1.49067 -1.472541
H  -4.33709 0.236543 0.363282
H  2.020463 -2.89283 -0.068286
H  1.807703 -2.463825 1.61997
H  3.790585 2.737974 -0.252635
elementType: Cl F O C H
totalener: -2049.15194235 hartree
nucrepener: 2379.19494205 hartree
electener: -4428.34688440 hartree
oneelecener: -7555.40441486 hartree
twoeener: 3127.05753046 hartree
cpcmener: -0.02643767 hartree
kineticenergy: 2043.56276812 hartree
xcener: -143.169530386778 hartree
chargesum: 0.0000000
charge: -0.059065 -0.056982 -0.200775 -0.202246 -0.204044 -0.202868 -0.272389 -0.481646 0.134668 -0.129658 -0.015278 -0.268542 -0.282780 -0.235472 0.412609 0.087334 0.061525 -0.130562 0.157056 0.280291 0.191198 0.203755 -0.156589 0.110185 0.115286 0.102197 0.093478 0.095688 0.099792 0.102097 0.092867 0.143949 0.122393 0.136040 0.156489
qa: -0.0591 -0.0570 -0.2008 -0.2022 -0.2040 -0.2029 -0.2724 -0.4816 0.1347 -0.1297 -0.0153 -0.2685 -0.2828 -0.2355 0.4126 0.0873 0.0615 -0.1306 0.1571 0.2803 0.1912 0.2038 -0.1566 0.1102 0.1153 0.1022 0.0935 0.0957 0.0998 0.1021 0.0929 0.1439 0.1224 0.1360 0.1565
va: 1.2868 1.2502 1.0916 1.0961 1.0845 1.0822 2.1121 2.0253 3.7363 3.8371 3.8361 3.8907 3.9149 3.9102 4.1406 4.1690 3.8335 3.5605 3.9156 3.8729 3.9646 3.9148 3.8675 1.0226 1.0217 0.9995 1.0134 1.0010 1.0020 0.9994 0.9998 1.0071 1.0176 0.9986 0.9970
dispcorr: -0.020065928 hartree
energy: -2049.172008281882
dipole: -24.74074 23.80110 -0.93964 -29.71639 28.77402 -0.94237 0.73967 0.53143 1.27110
magnitude: 1.84029 au
magnitude: 4.67764 debye
