program: Orca
programVersion: 5.0.2
elementType: Cl Cl F F F F O O C C C C C C C C C C C C C C C H H H H H H H H H H H H
charge: 0
multiplicity: 1
keywords: wb97x-d3
keywords: def2-TZVPP
keywords: def2/J RIJCOSX
keywords: DEFGRID2
keywords: scfconv7
keywords: smallprint printgap noloewdin
keywords: NOSOSCF
formula: C15H12Cl2F4O2
InChI: InChI=1/C15H12Cl2F4O2/c1-15(2)7(3-10(16)17)11(15)14(22)23-5-6-12(20)8(18)4-9(19)13(6)21/h3-4,7,11H,5H2,1-2H3
35 atoms
Cl -2.686388 -2.297555 1.544206
Cl -4.590788 -0.36898 2.532609
F  4.099352 0.974774 -1.923498
F  1.019607 -1.020612 1.031125
F  2.290258 0.094804 3.095134
F  5.392226 2.038852 0.150568
O  0.387646 -0.480217 -1.60202
O  0.598396 1.72196 -1.899407
C  -2.595399 0.107985 -2.289012
C  -1.554104 0.83907 -1.467571
C  -2.345308 -0.30982 -0.867811
C  -2.183615 -0.842302 -3.385906
C  -3.829386 0.903569 -2.63754
C  -3.281329 -0.01962 0.223007
C  -0.097176 0.754134 -1.688302
C  -3.486506 -0.79484 1.280571
C  1.797329 -0.659374 -1.685186
C  2.514034 -0.047423 -0.513665
C  3.638601 0.74158 -0.693223
C  2.087975 -0.258774 0.790299
C  2.749428 0.311022 1.861805
C  4.311121 1.293591 0.38126
C  3.872404 1.088652 1.67168
H  -1.852903 1.83595 -1.163328
H  -1.797741 -1.238505 -0.767492
H  -3.035929 -1.461699 -3.6694
H  -1.86813 -0.291928 -4.274137
H  -1.3774 -1.51328 -3.098458
H  -4.082946 1.650141 -1.886461
H  -3.679312 1.429332 -3.581765
H  -4.687964 0.241312 -2.759397
H  -3.84121 0.906965 0.181872
H  2.17846 -0.268439 -2.627476
H  1.942806 -1.738498 -1.694742
H  4.393509 1.524801 2.513977
elementType: Cl F O C H
totalener: -2049.15351095 hartree
nucrepener: 2287.00609907 hartree
electener: -4336.15961001 hartree
oneelecener: -7370.69587812 hartree
twoeener: 3034.53626811 hartree
cpcmener: -0.02708017 hartree
kineticenergy: 2043.54132992 hartree
xcener: -143.167297152540 hartree
chargesum: 0.0000000
charge: -0.059763 -0.062703 -0.204549 -0.202766 -0.204487 -0.204361 -0.275859 -0.481388 0.076662 -0.080371 0.048033 -0.260316 -0.273914 -0.213462 0.427761 0.045412 0.052788 -0.112347 0.238981 0.212064 0.192320 0.199020 -0.172323 0.099965 0.079968 0.097448 0.101470 0.093850 0.092943 0.098649 0.100726 0.131891 0.127380 0.135044 0.156234
qa: -0.0598 -0.0627 -0.2045 -0.2028 -0.2045 -0.2044 -0.2759 -0.4814 0.0767 -0.0804 0.0480 -0.2603 -0.2739 -0.2135 0.4278 0.0454 0.0528 -0.1123 0.2390 0.2121 0.1923 0.1990 -0.1723 0.1000 0.0800 0.0974 0.1015 0.0938 0.0929 0.0986 0.1007 0.1319 0.1274 0.1350 0.1562
va: 1.2651 1.2425 1.0933 1.0939 1.0846 1.0838 2.1188 2.0247 3.7753 3.8227 3.8132 3.9026 3.9125 3.8968 4.1470 4.2083 3.8485 3.5658 3.9054 3.9229 3.9657 3.9568 3.8691 1.0284 1.0474 0.9999 1.0001 1.0135 1.0056 1.0007 1.0008 1.0192 1.0141 0.9951 0.9976
dispcorr: -0.017757079 hartree
energy: -2049.171268024817
dipole: -18.72351 18.34142 -0.38209 2.62770 -3.23218 -0.60448 -29.14454 28.22894 -0.91560
magnitude: 1.16177 au
magnitude: 2.95300 debye
