program: Orca
programVersion: 5.0.2
elementType: Cl Cl F F F F O O C C C C C C C C C C C C C C C H H H H H H H H H H H H
charge: 0
multiplicity: 1
keywords: wb97x-d3
keywords: def2-TZVPP
keywords: def2/J RIJCOSX
keywords: DEFGRID2
keywords: scfconv7
keywords: smallprint printgap noloewdin
keywords: NOSOSCF
formula: C15H12Cl2F4O2
InChI: InChI=1/C15H12Cl2F4O2/c1-15(2)7(3-10(16)17)11(15)14(22)23-5-6-12(20)8(18)4-9(19)13(6)21/h3-4,7,11H,5H2,1-2H3
35 atoms
Cl -1.379852 1.460515 1.720029
Cl -3.725925 2.809667 0.721614
F  0.865863 1.633239 -1.012881
F  3.970753 -1.892988 -0.738534
F  4.791972 -0.981828 1.629553
F  1.656089 2.501181 1.388274
O  0.486241 -0.752078 -2.343594
O  0.436057 -2.299728 -0.733892
C  -2.67392 -2.112757 -0.882143
C  -1.594868 -1.263588 -1.500479
C  -2.237107 -0.874602 -0.163456
C  -2.371797 -3.441664 -0.232118
C  -3.988034 -2.114036 -1.62769
C  -3.032241 0.356196 -0.09936
C  -0.147909 -1.537654 -1.46724
C  -2.747271 1.39307 0.678548
C  1.90806 -0.690763 -2.271799
C  2.381869 -0.168642 -0.942276
C  1.822462 0.964071 -0.36899
C  3.388999 -0.804024 -0.234969
C  3.817342 -0.333104 0.991784
C  2.237189 1.421243 0.867408
C  3.241833 0.781018 1.561345
H  -1.91095 -0.663022 -2.345581
H  -1.598685 -1.058218 0.693625
H  -2.167355 -4.206976 -0.981924
H  -1.531105 -3.404635 0.455486
H  -3.244799 -3.765063 0.337032
H  -4.007181 -2.936754 -2.34379
H  -4.821423 -2.254442 -0.937757
H  -4.163355 -1.19567 -2.187237
H  -3.904489 0.444368 -0.735679
H  2.200648 -0.012949 -3.07219
H  2.346054 -1.66378 -2.49045
H  3.572049 1.147883 2.524366
elementType: Cl F O C H
totalener: -2049.15242945 hartree
nucrepener: 2365.16379018 hartree
electener: -4414.31621963 hartree
oneelecener: -7527.51694002 hartree
twoeener: 3113.20072040 hartree
cpcmener: -0.02510882 hartree
kineticenergy: 2043.56140407 hartree
xcener: -143.170006933817 hartree
chargesum: 0.0000000
charge: -0.060197 -0.060238 -0.200757 -0.204803 -0.204591 -0.202949 -0.284797 -0.479186 0.138132 -0.059093 -0.050845 -0.273024 -0.288582 -0.159184 0.397451 0.035819 0.069428 -0.102795 0.192183 0.240022 0.200916 0.186456 -0.170279 0.101398 0.098458 0.101720 0.091477 0.095419 0.100501 0.105710 0.092821 0.132759 0.139174 0.125072 0.156404
qa: -0.0602 -0.0602 -0.2008 -0.2048 -0.2046 -0.2029 -0.2848 -0.4792 0.1381 -0.0591 -0.0508 -0.2730 -0.2886 -0.1592 0.3975 0.0358 0.0694 -0.1028 0.1922 0.2400 0.2009 0.1865 -0.1703 0.1014 0.0985 0.1017 0.0915 0.0954 0.1005 0.1057 0.0928 0.1328 0.1392 0.1251 0.1564
va: 1.2754 1.2459 1.0932 1.0940 1.0834 1.0840 2.1170 2.0264 3.7713 3.8005 3.9247 3.8800 3.9166 3.8596 4.1536 4.2067 3.8372 3.5547 3.9282 3.9088 3.9593 3.9441 3.8759 1.0328 1.0373 0.9998 1.0195 1.0004 1.0010 0.9989 1.0027 1.0178 0.9923 1.0160 0.9974
dispcorr: -0.019088837 hartree
energy: -2049.171518283305
dipole: -22.01064 21.35251 -0.65813 -25.37662 25.21767 -0.15895 -14.65549 13.51758 -1.13791
magnitude: 1.32409 au
magnitude: 3.36558 debye
