program: Orca
programVersion: 5.0.2
elementType: Cl Cl F F F F O O C C C C C C C C C C C C C C C H H H H H H H H H H H H
charge: 0
multiplicity: 1
keywords: wb97x-d3
keywords: def2-TZVPP
keywords: def2/J RIJCOSX
keywords: DEFGRID2
keywords: scfconv7
keywords: smallprint printgap noloewdin
keywords: NOSOSCF
formula: C15H12Cl2F4O2
InChI: InChI=1/C15H12Cl2F4O2/c1-15(2)7(3-10(16)17)11(15)14(22)23-5-6-12(20)8(18)4-9(19)13(6)21/h3-4,7,11H,5H2,1-2H3
35 atoms
Cl -2.311921 0.995371 2.003274
Cl -4.714828 1.700641 0.571706
F  4.481135 -0.912467 -0.750781
F  0.517225 1.62607 -0.982451
F  1.244081 2.945191 1.205597
F  5.21591 0.448891 1.414761
O  0.691743 -0.798684 -2.204934
O  0.869315 -1.981524 -0.319463
C  -2.13716 -2.698905 -0.7382
C  -1.281204 -1.60058 -1.320946
C  -2.107287 -1.366729 -0.055081
C  -1.52722 -3.872281 -0.011135
C  -3.331221 -3.09236 -1.575592
C  -3.213358 -0.406251 -0.118205
C  0.18378 -1.518672 -1.200543
C  -3.382966 0.617338 0.709508
C  2.078121 -0.480931 -2.160795
C  2.469575 0.298977 -0.933393
C  3.666482 0.037223 -0.286016
C  1.67825 1.309164 -0.40658
C  2.054959 2.000461 0.729357
C  4.051004 0.743144 0.837809
C  3.247447 1.730418 1.365046
H  -1.677824 -1.140109 -2.218073
H  -1.518403 -1.342466 0.855067
H  -1.085075 -4.579153 -0.714985
H  -0.764877 -3.585391 0.707919
H  -2.310752 -4.399677 0.535367
H  -4.144153 -3.450867 -0.942146
H  -3.713983 -2.277284 -2.188443
H  -3.055904 -3.902445 -2.252529
H  -3.947105 -0.520649 -0.90714
H  2.25659 0.115319 -3.054796
H  2.675051 -1.388412 -2.247061
H  3.543881 2.278054 2.250275
elementType: Cl F O C H
totalener: -2049.15300695 hartree
nucrepener: 2318.11888793 hartree
electener: -4367.27189487 hartree
oneelecener: -7433.39861597 hartree
twoeener: 3066.12672109 hartree
cpcmener: -0.02505535 hartree
kineticenergy: 2043.55149584 hartree
xcener: -143.168777256004 hartree
chargesum: 0.0000000
charge: -0.058758 -0.059904 -0.204971 -0.203537 -0.205382 -0.204539 -0.287289 -0.478554 0.116501 -0.051946 -0.017450 -0.272201 -0.282353 -0.173249 0.395453 0.033739 0.074738 -0.094413 0.226122 0.198081 0.197696 0.198209 -0.173092 0.099557 0.089476 0.101538 0.092306 0.096396 0.103837 0.094578 0.099275 0.130766 0.137121 0.126746 0.155503
qa: -0.0588 -0.0599 -0.2050 -0.2035 -0.2054 -0.2045 -0.2873 -0.4786 0.1165 -0.0519 -0.0175 -0.2722 -0.2824 -0.1732 0.3955 0.0337 0.0747 -0.0944 0.2261 0.1981 0.1977 0.1982 -0.1731 0.0996 0.0895 0.1015 0.0923 0.0964 0.1038 0.0946 0.0993 0.1308 0.1371 0.1267 0.1555
va: 1.2678 1.2458 1.0935 1.0919 1.0826 1.0834 2.1202 2.0210 3.7624 3.8080 3.9090 3.8886 3.9139 3.8838 4.1413 4.2141 3.8328 3.5490 3.9247 3.9351 3.9595 3.9574 3.8716 1.0329 1.0416 0.9995 1.0208 1.0000 0.9997 1.0038 1.0008 1.0191 0.9925 1.0143 0.9979
dispcorr: -0.017970374 hartree
energy: -2049.170977320561
dipole: -14.17520 13.77145 -0.40376 -30.22979 29.69920 -0.53059 -13.80300 12.40870 -1.39430
magnitude: 1.54551 au
magnitude: 3.92838 debye
