program: Orca
programVersion: 5.0.2
elementType: Cl Cl F F F F O O C C C C C C C C C C C C C C C H H H H H H H H H H H H
charge: 0
multiplicity: 1
keywords: wb97x-d3
keywords: def2-TZVPP
keywords: def2/J RIJCOSX
keywords: DEFGRID2
keywords: scfconv7
keywords: smallprint printgap noloewdin
keywords: NOSOSCF
formula: C15H12Cl2F4O2
InChI: InChI=1/C15H12Cl2F4O2/c1-15(2)7(3-10(16)17)11(15)14(22)23-5-6-12(20)8(18)4-9(19)13(6)21/h3-4,7,11H,5H2,1-2H3
35 atoms
Cl -2.120817 1.707431 1.856423
Cl -4.87393 2.207938 1.1553
F  1.373841 1.86968 -0.571854
F  3.624304 -2.252259 -0.787685
F  5.00688 -1.611205 1.404943
F  2.743248 2.494929 1.646241
O  0.29957 -0.726338 -1.4454
O  -0.480091 -1.021295 -3.513759
C  -2.4246 -2.037038 -0.680587
C  -2.018678 -1.008724 -1.715747
C  -2.287629 -0.593554 -0.282111
C  -1.414443 -3.012642 -0.126077
C  -3.793512 -2.648209 -0.860746
C  -3.445349 0.260954 0.000463
C  -0.673907 -0.926177 -2.325817
C  -3.467053 1.252329 0.882711
C  1.630528 -0.559776 -1.937875
C  2.460969 -0.206841 -0.742412
C  2.264473 1.002538 -0.091086
C  3.399045 -1.073328 -0.209165
C  4.115523 -0.742987 0.927271
C  2.973333 1.327587 1.047265
C  3.907824 0.457526 1.569367
H  -2.793614 -0.77488 -2.437496
H  -1.404197 -0.376979 0.305657
H  -0.458318 -2.553909 0.116642
H  -1.802082 -3.458075 0.791962
H  -1.230892 -3.824448 -0.832562
H  -4.215509 -2.939159 0.103187
H  -4.501908 -1.979069 -1.348093
H  -3.724143 -3.546786 -1.476245
H  -4.358121 0.086253 -0.556641
H  1.665085 0.237013 -2.683103
H  1.982355 -1.47433 -2.414152
H  4.463275 0.714445 2.46208
elementType: Cl F O C H
totalener: -2049.16726129 hartree
nucrepener: 2273.13342608 hartree
electener: -4322.30068737 hartree
oneelecener: -7342.13793103 hartree
twoeener: 3019.83724366 hartree
cpcmener: -0.02183032 hartree
kineticenergy: 2043.55087837 hartree
xcener: -143.165618230593 hartree
chargesum: -0.0000000
charge: -0.058665 -0.061426 -0.201828 -0.202458 -0.201680 -0.201210 -0.266839 -0.457137 0.075830 -0.078622 0.057105 -0.260384 -0.273343 -0.217465 0.406410 0.048380 0.063760 -0.192641 0.234420 0.273762 0.186541 0.197736 -0.157245 0.098246 0.078404 0.090765 0.096614 0.101112 0.101071 0.091322 0.098713 0.127569 0.133739 0.116492 0.152949
qa: -0.0587 -0.0614 -0.2018 -0.2025 -0.2017 -0.2012 -0.2668 -0.4571 0.0758 -0.0786 0.0571 -0.2604 -0.2733 -0.2175 0.4064 0.0484 0.0638 -0.1926 0.2344 0.2738 0.1865 0.1977 -0.1572 0.0982 0.0784 0.0908 0.0966 0.1011 0.1011 0.0913 0.0987 0.1276 0.1337 0.1165 0.1529
va: 1.2675 1.2438 1.0970 1.0987 1.0870 1.0883 2.1183 2.0504 3.7687 3.8504 3.8218 3.9038 3.9111 3.9001 4.1714 4.2121 3.8219 3.7107 3.8867 3.8701 3.9690 3.9697 3.8586 1.0285 1.0351 1.0131 1.0004 1.0002 1.0004 1.0062 1.0008 1.0209 1.0001 1.0143 0.9988
dispcorr: -0.017353483 hartree
energy: -2049.184614770953
dipole: -17.65350 17.79013 0.13663 -24.38099 23.51270 -0.86828 -13.11898 13.65328 0.53430
magnitude: 1.02862 au
magnitude: 2.61453 debye
