program: Orca
programVersion: 5.0.2
elementType: Cl Cl F F F F O O C C C C C C C C C C C C C C C H H H H H H H H H H H H
charge: 0
multiplicity: 1
keywords: wb97x-d3
keywords: def2-TZVPP
keywords: def2/J RIJCOSX
keywords: DEFGRID2
keywords: scfconv7
keywords: smallprint printgap noloewdin
keywords: NOSOSCF
formula: C15H12Cl2F4O2
InChI: InChI=1/C15H12Cl2F4O2/c1-15(2)7(3-10(16)17)11(15)14(22)23-5-6-12(20)8(18)4-9(19)13(6)21/h3-4,7,11H,5H2,1-2H3
35 atoms
Cl -2.032829 0.52245 2.232901
Cl -4.852333 0.910054 1.764058
F  4.079242 -1.340675 -0.644141
F  0.798472 2.025226 -0.711548
F  1.749201 2.99198 1.604572
F  5.031083 -0.364824 1.653329
O  0.486625 -0.687896 -1.628963
O  -0.339402 -0.248675 -3.658539
C  -2.120455 -2.325172 -1.315056
C  -1.818838 -0.993672 -1.970758
C  -2.086942 -1.078386 -0.477618
C  -1.030305 -3.34691 -1.101938
C  -3.444565 -2.954191 -1.677288
C  -3.303416 -0.460586 0.062565
C  -0.498746 -0.60738 -2.517001
C  -3.376348 0.225418 1.196724
C  1.795878 -0.242818 -1.988189
C  2.404127 0.311538 -0.735626
C  3.49184 -0.270944 -0.108764
C  1.83923 1.426312 -0.132887
C  2.333654 1.929558 1.05299
C  3.991073 0.237687 1.077622
C  3.417762 1.340343 1.670967
H  -2.627325 -0.606578 -2.581131
H  -1.208856 -0.984734 0.149461
H  -0.106607 -2.922742 -0.715554
H  -1.368301 -4.095414 -0.383114
H  -0.801233 -3.867475 -2.033756
H  -3.820892 -3.558447 -0.849686
H  -4.211596 -2.224628 -1.934023
H  -3.324172 -3.612302 -2.539502
H  -4.222277 -0.560648 -0.502838
H  1.755227 0.51944 -2.767316
H  2.368376 -1.083453 -2.378418
H  3.80952 1.737989 2.598426
elementType: Cl F O C H
totalener: -2049.16617277 hartree
nucrepener: 2290.04350992 hartree
electener: -4339.20968269 hartree
oneelecener: -7376.05314918 hartree
twoeener: 3036.84346648 hartree
cpcmener: -0.02163780 hartree
kineticenergy: 2043.53990341 hartree
xcener: -143.164391559033 hartree
chargesum: -0.0000000
charge: -0.059476 -0.061137 -0.202311 -0.201805 -0.201452 -0.201734 -0.271478 -0.454789 0.080626 -0.085648 0.047413 -0.260338 -0.277019 -0.212840 0.412558 0.049905 0.041873 -0.148969 0.253376 0.222153 0.205249 0.197020 -0.165831 0.098667 0.078611 0.091691 0.095396 0.100787 0.101456 0.092198 0.098478 0.126761 0.136823 0.119976 0.153811
qa: -0.0595 -0.0611 -0.2023 -0.2018 -0.2015 -0.2017 -0.2715 -0.4548 0.0806 -0.0856 0.0474 -0.2603 -0.2770 -0.2128 0.4126 0.0499 0.0419 -0.1490 0.2534 0.2222 0.2052 0.1970 -0.1658 0.0987 0.0786 0.0917 0.0954 0.1008 0.1015 0.0922 0.0985 0.1268 0.1368 0.1200 0.1538
va: 1.2673 1.2438 1.0981 1.0975 1.0873 1.0868 2.1055 2.0530 3.7665 3.8299 3.8214 3.8998 3.9147 3.8974 4.1744 4.2111 3.8191 3.6531 3.8944 3.8861 3.9704 3.9576 3.8648 1.0279 1.0396 1.0153 1.0004 1.0000 1.0003 1.0060 1.0010 1.0217 1.0113 1.0108 0.9982
dispcorr: -0.017601043 hartree
energy: -2049.183773810297
dipole: -14.26783 14.48368 0.21585 -24.89034 23.85632 -1.03402 -20.22250 20.45708 0.23458
magnitude: 1.08204 au
magnitude: 2.75034 debye
