program: Orca
programVersion: 5.0.2
elementType: Cl Cl F F F F O O C C C C C C C C C C C C C C C H H H H H H H H H H H H
charge: 0
multiplicity: 1
keywords: wb97x-d3
keywords: def2-TZVPP
keywords: def2/J RIJCOSX
keywords: DEFGRID2
keywords: scfconv7
keywords: smallprint printgap noloewdin
keywords: NOSOSCF
formula: C15H12Cl2F4O2
InChI: InChI=1/C15H12Cl2F4O2/c1-15(2)7(3-10(16)17)11(15)14(22)23-5-6-12(20)8(18)4-9(19)13(6)21/h3-4,7,11H,5H2,1-2H3
35 atoms
Cl -2.962766 0.73039 2.425853
Cl -4.96169 1.642718 0.556246
F  4.071232 -1.406209 0.264554
F  1.32511 1.712627 -1.942159
F  2.083859 3.602397 -0.205132
F  4.863114 0.49938 1.958291
O  0.828056 -1.091814 -1.936579
O  0.799457 -1.857818 0.159425
C  -2.15892 -2.645426 -0.510033
C  -1.251386 -1.563555 -1.053065
C  -2.161711 -1.29219 0.137128
C  -1.603815 -3.800954 0.286069
C  -3.298467 -3.052939 -1.41377
C  -3.260285 -0.33591 -0.036816
C  0.209033 -1.542114 -0.844249
C  -3.663629 0.551503 0.863797
C  2.244646 -0.946222 -1.884185
C  2.678148 0.099782 -0.895568
C  3.574991 -0.176693 0.123467
C  2.190499 1.395162 -0.978886
C  2.583959 2.372199 -0.085203
C  3.982586 0.806724 1.005724
C  3.487953 2.089714 0.916407
H  -1.571622 -1.133597 -1.995272
H  -1.647264 -1.251533 1.090461
H  -0.879659 -3.49857 1.038321
H  -2.420792 -4.307555 0.803093
H  -1.126986 -4.532442 -0.369246
H  -4.156298 -3.384345 -0.825604
H  -3.632911 -2.253633 -2.073904
H  -2.991364 -3.88618 -2.04849
H  -3.785952 -0.335419 -0.984208
H  2.531599 -0.650221 -2.892245
H  2.720272 -1.904558 -1.679185
H  3.803087 2.85592 1.613078
elementType: Cl F O C H
totalener: -2049.16812506 hartree
nucrepener: 2264.68462591 hartree
electener: -4313.85275097 hartree
oneelecener: -7326.21839500 hartree
twoeener: 3012.36564404 hartree
cpcmener: -0.02127361 hartree
kineticenergy: 2043.54685033 hartree
xcener: -143.166318071887 hartree
chargesum: 0.0000000
charge: -0.055144 -0.060768 -0.204061 -0.201448 -0.202866 -0.202934 -0.280952 -0.459639 0.092875 -0.071433 0.020511 -0.266779 -0.271602 -0.198141 0.402438 0.040924 0.073370 -0.142249 0.267385 0.207481 0.189995 0.195198 -0.171362 0.093867 0.082286 0.094124 0.095735 0.099433 0.101486 0.092637 0.098177 0.127146 0.137895 0.122314 0.154102
qa: -0.0551 -0.0608 -0.2041 -0.2014 -0.2029 -0.2029 -0.2810 -0.4596 0.0929 -0.0714 0.0205 -0.2668 -0.2716 -0.1981 0.4024 0.0409 0.0734 -0.1422 0.2674 0.2075 0.1900 0.1952 -0.1714 0.0939 0.0823 0.0941 0.0957 0.0994 0.1015 0.0926 0.0982 0.1271 0.1379 0.1223 0.1541
va: 1.2706 1.2440 1.0946 1.0969 1.0865 1.0858 2.1262 2.0546 3.7346 3.8250 3.8760 3.9010 3.9123 3.9015 4.1663 4.2139 3.8359 3.5852 3.8620 3.9418 3.9625 3.9607 3.8641 1.0343 1.0465 1.0210 1.0000 0.9995 1.0006 1.0053 1.0010 1.0205 0.9907 1.0176 0.9985
dispcorr: -0.016936881 hartree
energy: -2049.185061943661
dipole: -13.23947 13.15340 -0.08608 -30.08926 29.42934 -0.65992 -12.14315 10.67487 -1.46828
magnitude: 1.61207 au
magnitude: 4.09755 debye
