program: Orca
programVersion: 5.0.2
elementType: Cl Cl F F F F O O C C C C C C C C C C C C C C C H H H H H H H H H H H H
charge: 0
multiplicity: 1
keywords: wb97x-d3
keywords: def2-TZVPP
keywords: def2/J RIJCOSX
keywords: DEFGRID2
keywords: scfconv7
keywords: smallprint printgap noloewdin
keywords: NOSOSCF
formula: C15H12Cl2F4O2
InChI: InChI=1/C15H12Cl2F4O2/c1-15(2)7(3-10(16)17)11(15)14(22)23-5-6-12(20)8(18)4-9(19)13(6)21/h3-4,7,11H,5H2,1-2H3
35 atoms
Cl -4.077228 1.582831 1.89205
Cl -4.447119 3.051446 -0.562703
F  1.230967 0.640703 0.892376
F  4.588512 -2.206865 -0.770012
F  6.18075 -0.097867 -1.142815
F  2.814792 2.74958 0.469282
O  0.711862 -1.755717 -0.416087
O  -0.53384 -2.024187 1.429485
C  -2.8851 -1.92033 -0.659063
C  -1.533091 -1.241382 -0.599128
C  -2.74979 -0.605976 0.052194
C  -3.176325 -3.142174 0.176486
C  -3.531003 -1.973911 -2.022743
C  -3.27642 0.643346 -0.508037
C  -0.436252 -1.716613 0.267974
C  -3.853844 1.616715 0.185313
C  1.93268 -2.011744 0.276104
C  2.85358 -0.845177 0.058992
C  2.443742 0.44243 0.37335
C  4.131009 -0.994644 -0.454741
C  4.958468 0.097267 -0.649258
C  3.263378 1.532842 0.164574
C  4.533846 1.372155 -0.347422
H  -1.206396 -0.79869 -1.533179
H  -2.768353 -0.679804 1.133375
H  -2.814937 -3.062981 1.199042
H  -4.255397 -3.299846 0.223872
H  -2.733622 -4.033754 -0.271868
H  -3.249715 -1.141037 -2.666152
H  -3.242146 -2.891636 -2.538073
H  -4.618803 -1.97346 -1.9319
H  -3.189321 0.795971 -1.57706
H  2.355813 -2.929092 -0.128635
H  1.762717 -2.170511 1.3415
H  5.180476 2.225335 -0.506741
elementType: Cl F O C H
totalener: -2049.16709273 hartree
nucrepener: 2218.79550141 hartree
electener: -4267.96259414 hartree
oneelecener: -7234.02807144 hartree
twoeener: 2966.06547730 hartree
cpcmener: -0.02040991 hartree
kineticenergy: 2043.54196274 hartree
xcener: -143.165361596156 hartree
chargesum: -0.0000000
charge: -0.055882 -0.060924 -0.202961 -0.202525 -0.201614 -0.200844 -0.284400 -0.453548 0.089011 -0.084915 0.032771 -0.267073 -0.265991 -0.205169 0.397571 0.043578 0.074499 -0.111391 0.229620 0.215610 0.205995 0.197381 -0.170195 0.096712 0.079261 0.094819 0.096973 0.098537 0.091045 0.098529 0.101061 0.128130 0.115819 0.126781 0.153728
qa: -0.0559 -0.0609 -0.2030 -0.2025 -0.2016 -0.2008 -0.2844 -0.4535 0.0890 -0.0849 0.0328 -0.2671 -0.2660 -0.2052 0.3976 0.0436 0.0745 -0.1114 0.2296 0.2156 0.2060 0.1974 -0.1702 0.0967 0.0793 0.0948 0.0970 0.0985 0.0910 0.0985 0.1011 0.1281 0.1158 0.1268 0.1537
va: 1.2697 1.2439 1.0970 1.0971 1.0872 1.0889 2.1152 2.0584 3.7442 3.8296 3.8551 3.9060 3.9089 3.9048 4.1960 4.2114 3.8294 3.6183 3.8705 3.9105 3.9567 3.9927 3.8708 1.0337 1.0505 1.0192 1.0002 0.9996 1.0056 1.0011 1.0010 1.0194 1.0085 1.0201 0.9987
dispcorr: -0.016383872 hartree
energy: -2049.183476605755
dipole: -19.83903 20.33401 0.49497 -25.99771 25.30224 -0.69547 -8.08288 6.71787 -1.36501
magnitude: 1.60995 au
magnitude: 4.09216 debye
