program: Gaussian 09
title: 000062388
version: EM64L-G09RevD.01
frameworkgroup: C1[X(C13H20O3)]
method: RPBEPBE
basis: SDD
operation: Freq
keyword: #pfreq=noraman
keyword: PBEPBE/SDD
title: #p freq=noraman PBEPBE/SDD
converged: YES YES NO NO
title: Mulliken charges:
elementType: O O O C C C C C C C C C C C C C H H H H H H H H H H H H H H H H H H H H
charge: -0.183551 -0.269568 -0.241801 -0.107296 -0.156361 -0.481310 -0.528218 0.090942 -0.543518 -0.544183 -0.159206 0.259369 -0.167867 -0.441665 -0.505677 -0.685914 0.271780 0.265980 0.226966 0.227036 0.259767 0.248381 0.239640 0.232877 0.214294 0.241709 0.217774 0.217250 0.202567 0.200720 0.265737 0.210354 0.203610 0.235676 0.244077 0.239629
chargesum: 0.00000
title: Mulliken charges with hydrogens summed into heavy atoms:
elementType: O O O C C C C C C C C C C C C C
charge: -0.183551 -0.269568 -0.241801 0.164484 0.109619 -0.027308 -0.020070 0.090942 -0.071001 -0.088180 0.058568 0.259369 0.049383 -0.038378 0.213705 -0.006213
polarizability: 1.77050498e+02 2.32065932e+00 1.28045600e+02 -5.27645929e+00 -6.35879207e+00 1.34298698e+02
1716.lowfreq: -13.2082 -9.4397 -6.7456 -0.0003 0.0004 0.0008 11.6677 35.6195 44.3193
frequency: 10.6716 35.5172 44.2836 50.6451 52.8937 82.3458 96.5606 107.6828 121.2535 144.3812 158.0846 186.0420 210.1455 232.2476 259.0054 269.6906 293.7621 339.2513 393.9801 399.0488 436.9172 470.2452 498.5125 527.4990 602.6987 615.6485 646.8531 699.2818 769.6765 790.0613 797.3291 818.1644 831.1848 838.5284 887.5988 898.1339 933.6750 949.5218 970.1898 972.9555 998.9315 1009.4926 1017.2935 1044.8081 1056.2130 1068.7461 1091.0016 1109.6743 1110.1540 1127.0167 1148.1191 1155.9847 1160.8142 1164.8351 1192.2917 1228.6336 1236.9887 1244.5871 1251.5156 1270.3825 1273.9925 1291.4532 1297.2776 1301.1282 1303.7357 1325.1849 1333.8851 1347.0390 1391.0393 1419.7459 1435.5181 1450.1188 1451.3600 1462.2714 1463.6132 1465.3253 1474.7749 1476.7489 1493.3234 1641.4968 1651.7288 1683.0945 2966.4819 2974.8907 2975.7933 2986.7028 2995.9307 3000.1126 3004.2776 3012.3768 3023.3751 3024.6179 3036.0322 3059.2745 3063.0637 3068.1212 3072.5527 3076.8653 3084.0027 3088.1387 3105.9265 3150.5358
redmass: 4.5983 4.3883 3.8268 3.6321 3.7814 3.6438 1.2326 2.2685 2.7190 2.8182 3.2387 2.5666 2.3805 1.8134 3.2774 2.0682 2.6978 2.8082 2.5402 2.7949 3.2423 3.6048 2.4104 2.5705 4.1031 4.5167 3.6301 4.4045 1.5987 1.6142 3.4845 2.1870 2.4789 2.1950 1.8619 2.4506 1.9579 2.4799 3.0556 1.1762 2.0135 2.0131 2.0867 2.1247 2.2241 1.8095 1.8533 2.0965 1.3101 1.8941 1.4405 2.6018 1.7282 1.8210 1.5832 1.2987 1.4845 1.2310 1.3062 1.4266 1.2805 1.3097 1.3140 1.4157 1.3276 1.5274 1.4010 1.3880 1.1935 1.1797 1.0809 1.1012 1.0519 1.1011 1.0510 1.0810 1.0891 1.0445 1.0579 9.2522 12.0945 6.5147 1.0601 1.0574 1.0382 1.0663 1.0825 1.0640 1.0297 1.0592 1.0845 1.0975 1.1005 1.0943 1.0997 1.0966 1.0915 1.0982 1.1034 1.1014 1.1044 1.1048
irintensity: 0.3051 3.2312 1.5327 0.4807 1.6755 4.2433 0.1942 0.0054 1.1778 1.0950 1.7916 2.2313 6.9743 1.8551 13.2569 5.1456 1.4578 2.7400 1.8682 4.3563 0.4700 3.9135 2.0077 3.7821 4.5196 0.6006 7.6747 6.8318 6.4535 8.7687 16.4046 1.2047 2.1125 3.1819 6.0448 5.4150 8.5299 15.5964 20.9574 43.5812 14.6373 8.3664 23.4304 6.0542 11.7642 6.6282 51.7943 72.9331 1.3984 25.8005 6.6993 44.7391 34.7525 29.3973 31.4344 11.0327 30.1854 4.6026 19.5258 14.1149 7.9767 4.6713 8.2982 4.1701 15.4800 10.4642 1.4628 15.4704 10.7600 19.6212 17.6131 18.4601 10.2719 10.9082 8.5908 9.9626 13.6724 7.4685 10.9768 197.8330 179.3736 0.3522 45.7579 27.7596 37.0455 8.6716 6.0459 22.4061 27.1430 15.4826 11.4057 12.8795 11.2243 1.1413 25.6177 7.1727 106.9622 28.7801 14.7406 29.9409 27.5153 14.1934
temp: 298.150 k
press: 1.00000 atm
elementType: 8 8 8 6 6 6 6 6 6 6 6 6 6 6 6 6 1 1 1 1 1 1 1 1 1 1 1 1 1 1 1 1 1 1 1 1
symmnumber: 1
zpe: 797505.9 jmol-1
zpe.correction: 0.303754 hartree
zpe.thermalcorrener: 0.321963 hartree
zpe.thermalcorrenthalpy: 0.322908 hartree
zpe.thermalcorrgfe: 0.254501 hartree
zpe.sumelectzpe: -731.783294 hartree
zpe.sumelectthermal: -731.765084 hartree
zpe.sumelectthermalent: -731.764140 hartree
zpe.sumelectthermalfe: -731.832547 hartree
dipole: -0.9145 1.1927 1.5744
dipole: 2.1766
quadrupole: -104.7343 -92.4196 -98.0329
quadrupole: 2.2054 16.5282 -8.1682
quadrupole: -6.3387 5.9760 0.3628 2.2054 16.5282 -8.1682
hfenergy: -732.0870476 hartree
pointgroup: C01 [X(C13H20O3)]
dipole: -0.136897 -0.5581948 -0.634809 debye
polarizability: 169.7341908|17.7386885|136.1608959|6.8530205|-3.9439083|133.4997091 unknown
InChI: InChI=1S/C13H20O3/c1-3-4-5-6-11-10(7-8-12(11)14)9-13(15)16-2/h4-5,10-11H,3,6-9H2,1-2H3
charge 0 multiplicity 1
36 atoms
O  2.664898 2.189291 1.551755
O  0.905422 -2.569003 0.541438
O  -0.803988 -2.350642 -1.026012
C  0.768389 0.423431 -1.060842
C  0.884882 0.878735 0.422643
C  1.643192 1.449842 -1.855156
C  2.80386 1.817611 -0.90202
C  2.195269 1.689627 0.501054
C  1.273157 -1.036291 -1.280751
C  -0.321918 1.755447 0.908897
C  -1.578231 0.927614 1.058865
C  0.341006 -2.038546 -0.625851
C  -2.68652 1.032526 0.279035
C  -3.911578 0.148247 0.378199
C  0.055271 -3.531223 1.287059
C  -4.115835 -0.70749 -0.901624
H  -0.284717 0.462119 -1.394267
H  0.970624 0.019833 1.117826
H  1.043401 2.352404 -2.077577
H  1.990345 1.041429 -2.820329
H  3.234001 2.821908 -1.054586
H  3.641062 1.094669 -0.981701
H  2.294265 -1.167102 -0.882973
H  1.282485 -1.249849 -2.365215
H  -0.492667 2.582825 0.192503
H  -0.029609 2.210343 1.875779
H  -1.555654 0.157776 1.847845
H  -2.70473 1.796813 -0.516311
H  -3.82054 -0.51692 1.258607
H  -4.813489 0.773801 0.540964
H  -3.250895 -1.373534 -1.068317
H  -5.027829 -1.327394 -0.818166
H  -4.226937 -0.062958 -1.794154
H  0.654944 -3.815347 2.162806
H  -0.169939 -4.407399 0.656366
H  -0.891197 -3.051194 1.588411
