program: Orca
programVersion: 5.0.2
elementType: Cl Cl F F F F O O C C C C C C C C C C C C C C C H H H H H H H H H H H H
charge: 0
multiplicity: 1
keywords: wb97x-d3
keywords: def2-TZVPP
keywords: def2/J RIJCOSX
keywords: DEFGRID2
keywords: scfconv7
keywords: smallprint printgap noloewdin
keywords: NOSOSCF
formula: C15H12Cl2F4O2
InChI: InChI=1/C15H12Cl2F4O2/c1-15(2)7(3-10(16)17)11(15)14(22)23-5-6-12(20)8(18)4-9(19)13(6)21/h3-4,7,11H,5H2,1-2H3
35 atoms
Cl -3.261175 -2.73866 0.369334
Cl -4.795645 -1.301021 2.344912
F  3.817675 1.876641 -1.597506
F  1.461924 -1.635426 0.461845
F  2.978605 -1.358475 2.65499
F  5.349175 2.120756 0.575095
O  0.323156 0.125611 -1.472876
O  0.632865 2.281231 -0.988007
C  -2.640807 1.147131 -1.699753
C  -1.526431 1.359464 -0.697299
C  -2.391335 0.118771 -0.628042
C  -2.325291 0.767992 -3.125573
C  -3.825353 2.075924 -1.587854
C  -3.301478 -0.044392 0.512031
C  -0.093439 1.320441 -1.063209
C  -3.721519 -1.204393 1.000677
C  1.696888 -0.020137 -1.826354
C  2.592359 0.114932 -0.627556
C  3.599818 1.062988 -0.56506
C  2.414107 -0.701881 0.47896
C  3.200252 -0.565395 1.606957
C  4.396395 1.188355 0.558341
C  4.203133 0.379962 1.657548
H  -1.72926 2.132438 0.036258
H  -1.926986 -0.793463 -0.982183
H  -2.032816 1.64807 -3.701893
H  -1.530257 0.030035 -3.212018
H  -3.212604 0.344808 -3.599805
H  -3.673991 2.954974 -2.21675
H  -4.735483 1.577944 -1.927718
H  -3.998145 2.431123 -0.572632
H  -3.664895 0.849614 1.004761
H  1.969753 0.686084 -2.609352
H  1.77281 -1.02114 -2.248479
H  4.821947 0.485448 2.539594
elementType: Cl F O C H
totalener: -2049.16641464 hartree
nucrepener: 2262.04132449 hartree
electener: -4311.20773913 hartree
oneelecener: -7320.64527632 hartree
twoeener: 3009.43753719 hartree
cpcmener: -0.02247656 hartree
kineticenergy: 2043.54494662 hartree
xcener: -143.165976925285 hartree
chargesum: -0.0000000
charge: -0.057255 -0.061256 -0.202557 -0.201351 -0.202008 -0.202680 -0.273231 -0.450289 0.076755 -0.107632 0.063218 -0.262140 -0.267069 -0.221375 0.421074 0.043108 0.049237 -0.142989 0.259847 0.218635 0.189991 0.197281 -0.170018 0.098586 0.081352 0.101004 0.092351 0.097076 0.097878 0.100680 0.090153 0.130417 0.124465 0.135437 0.153309
qa: -0.0573 -0.0613 -0.2026 -0.2014 -0.2020 -0.2027 -0.2732 -0.4503 0.0768 -0.1076 0.0632 -0.2621 -0.2671 -0.2214 0.4211 0.0431 0.0492 -0.1430 0.2598 0.2186 0.1900 0.1973 -0.1700 0.0986 0.0814 0.1010 0.0924 0.0971 0.0979 0.1007 0.0902 0.1304 0.1245 0.1354 0.1533
va: 1.2684 1.2439 1.0958 1.0976 1.0874 1.0864 2.1170 2.0664 3.7632 3.8551 3.7976 3.9051 3.9075 3.8899 4.1709 4.2089 3.8526 3.6004 3.8767 3.9221 3.9642 3.9619 3.8667 1.0292 1.0464 1.0002 1.0145 1.0005 1.0017 1.0009 1.0057 1.0177 1.0151 0.9944 0.9990
dispcorr: -0.017453352 hartree
energy: -2049.183867987915
dipole: -18.57666 18.31099 -0.26568 15.02376 -15.08327 -0.05951 -22.11966 21.23945 -0.88021
magnitude: 0.92135 au
magnitude: 2.34190 debye
