program: Orca
programVersion: 5.0.2
elementType: Cl Cl F F F F O O C C C C C C C C C C C C C C C H H H H H H H H H H H H
charge: 0
multiplicity: 1
keywords: wb97x-d3
keywords: def2-TZVPP
keywords: def2/J RIJCOSX
keywords: DEFGRID2
keywords: scfconv7
keywords: smallprint printgap noloewdin
keywords: NOSOSCF
formula: C15H12Cl2F4O2
InChI: InChI=1/C15H12Cl2F4O2/c1-15(2)7(3-10(16)17)11(15)14(22)23-5-6-12(20)8(18)4-9(19)13(6)21/h3-4,7,11H,5H2,1-2H3
35 atoms
Cl -4.743104 1.396075 1.2030
Cl -6.251259 0.755919 -1.170561
F  3.180713 2.471613 -0.759001
F  2.342356 -1.397389 1.78277
F  4.735504 -2.374072 1.069005
F  5.568595 1.503407 -1.444703
O  0.260586 0.299007 0.638544
O  0.620959 0.643205 -1.533654
C  -1.817018 -1.777706 -0.08947
C  -1.262477 -0.631821 -0.904785
C  -2.517622 -0.449716 -0.057169
C  -1.167133 -2.259439 1.185961
C  -2.401336 -2.913617 -0.897179
C  -3.792523 -0.214356 -0.743893
C  -0.039293 0.154954 -0.647998
C  -4.784434 0.543151 -0.292062
C  1.369948 1.126958 0.977757
C  2.691793 0.565201 0.535487
C  3.541572 1.275071 -0.297384
C  3.124278 -0.675555 0.978374
C  4.3579 -1.179973 0.612866
C  4.780052 0.774711 -0.654368
C  5.200922 -0.458688 -0.206329
H  -1.445074 -0.717385 -1.970133
H  -2.37172 0.109503 0.859551
H  -0.261926 -2.831599 0.975277
H  -0.914711 -1.460394 1.877607
H  -1.860056 -2.925383 1.703866
H  -3.206294 -3.403246 -0.345845
H  -2.799223 -2.597737 -1.860886
H  -1.632959 -3.663087 -1.095372
H  -3.946277 -0.689901 -1.705312
H  1.34087 1.196528 2.064242
H  1.221327 2.131982 0.584732
H  6.169641 -0.851304 -0.488229
elementType: Cl F O C H
totalener: -2049.16553288 hartree
nucrepener: 2228.20726203 hartree
electener: -4277.37279491 hartree
oneelecener: -7252.74737441 hartree
twoeener: 2975.37457951 hartree
cpcmener: -0.02213620 hartree
kineticenergy: 2043.53796243 hartree
xcener: -143.164851616451 hartree
chargesum: -0.0000000
charge: -0.056781 -0.060028 -0.203036 -0.202775 -0.202526 -0.202618 -0.272662 -0.457341 0.114341 -0.116760 0.031674 -0.273083 -0.269515 -0.208802 0.429865 0.042226 0.047193 -0.125695 0.259594 0.212928 0.191583 0.196483 -0.174524 0.091929 0.088764 0.097951 0.091640 0.097111 0.099419 0.091395 0.099360 0.128179 0.134855 0.125955 0.153702
qa: -0.0568 -0.0600 -0.2030 -0.2028 -0.2025 -0.2026 -0.2727 -0.4573 0.1143 -0.1168 0.0317 -0.2731 -0.2695 -0.2088 0.4299 0.0422 0.0472 -0.1257 0.2596 0.2129 0.1916 0.1965 -0.1745 0.0919 0.0888 0.0980 0.0916 0.0971 0.0994 0.0914 0.0994 0.1282 0.1349 0.1260 0.1537
va: 1.2693 1.2453 1.0952 1.0954 1.0866 1.0863 2.1196 2.0590 3.6820 3.8466 3.8599 3.8995 3.9157 3.8995 4.1792 4.2140 3.8477 3.5643 3.8729 3.9061 3.9756 3.9602 3.8712 1.0322 1.0389 1.0042 1.0151 1.0012 1.0011 1.0061 1.0005 1.0205 0.9945 1.0153 0.9986
dispcorr: -0.017520883 hartree
energy: -2049.183053758540
dipole: -9.03682 9.28215 0.24533 -17.87209 16.85954 -1.01255 -0.01218 0.81390 0.80173
magnitude: 1.31462 au
magnitude: 3.34149 debye
