program: Gaussian 09
title: 000073467
version: EM64L-G09RevD.01
frameworkgroup: C1[X(C17H24O10)]
method: RPBEPBE
basis: SDD
operation: Freq
keyword: #p
keyword: freq=noraman
keyword: PBEPBE/SDD
title: #p freq=noraman PBEPBE/SDD
converged: YES YES NO NO
title: Mulliken charges:
elementType: O O O O O O O O O O C C C C C C C C C C C C C C C C C H H H H H H H H H H H H H H H H H H H H H H H H
charge: -0.252834 -0.207789 -0.260660 -0.164742 -0.457573 -0.463972 -0.464422 -0.285039 -0.448493 -0.262981 -0.219525 -0.056801 -0.313041 -0.059973 -0.592476 0.111623 0.262218 -0.757912 -0.030423 -0.162224 -0.159150 -0.102548 0.017899 -0.270524 0.100200 -0.397484 -0.497570 0.277314 0.279022 0.303372 0.259280 0.249937 0.298284 0.222845 0.223488 0.221363 0.226802 0.245170 0.231125 0.223582 0.234362 0.284018 0.200025 0.241192 0.369506 0.372237 0.369056 0.352152 0.237252 0.227767 0.247064
chargesum: 0.00000
title: Mulliken charges with hydrogens summed into heavy atoms:
elementType: O O O O O O O O O O C C C C C C C C C C C C C C C C C
charge: -0.252834 -0.207789 -0.260660 -0.164742 -0.088067 -0.091735 -0.095367 -0.285039 -0.096341 -0.262981 0.057789 0.222221 -0.009669 0.199307 -0.044254 0.111623 0.262218 -0.090215 0.196379 0.082946 0.071975 0.121034 0.252261 0.013494 0.100200 0.043733 0.214513
polarizability: 2.77598961e+02 5.12880465e+00 2.03563095e+02 -8.60576155e+00 4.97899040e+00 1.65744451e+02
1716.lowfreq: -9.3107 -0.0010 -0.0006 -0.0003 2.6760 4.1680 18.4648 22.9462 28.9477
frequency: 17.3646 22.5095 28.9209 52.2673 53.9570 67.5012 74.1834 87.2999 90.0835 97.9592 98.8337 110.6895 128.7639 136.5315 140.2711 172.1647 180.3661 202.5098 214.7514 220.0965 233.2391 238.5882 264.3605 282.6222 287.2470 301.3487 306.4291 342.1322 346.1957 354.0356 386.8673 393.1800 401.0636 405.3440 428.1661 429.3575 435.1059 447.7058 451.4347 464.6178 502.6462 507.3394 529.5182 560.6067 581.0467 592.8171 598.2992 616.6430 644.0558 699.6702 707.7956 737.8654 748.9670 828.0231 855.7291 872.3199 880.0754 901.3738 911.7696 932.1185 943.6003 946.9701 951.2035 973.4331 977.6718 998.8810 1009.6243 1020.2944 1023.2881 1031.1971 1036.1530 1045.4152 1050.9613 1058.2715 1062.9019 1070.0615 1088.1907 1114.6230 1114.9859 1124.9635 1127.1409 1143.7044 1152.0035 1165.4654 1170.8427 1179.7772 1192.4869 1201.9407 1209.9066 1221.3898 1224.2343 1241.6971 1244.3277 1263.2220 1271.6350 1275.9163 1277.8812 1279.2165 1292.8761 1305.1843 1313.1484 1315.9739 1319.2115 1347.6629 1349.6954 1353.2495 1364.2776 1372.0893 1389.2207 1390.5137 1394.2828 1405.4025 1423.8046 1425.3354 1438.6761 1451.3708 1463.6026 1466.4269 1475.8921 1479.7555 1609.0170 1633.4853 1662.6135 2939.7374 2957.8803 2961.6133 2969.8391 2973.0693 2985.5874 2987.4159 2995.6643 3000.5435 3002.6473 3003.8987 3033.4447 3039.2698 3045.5566 3053.4104 3070.1585 3075.0932 3104.0896 3145.2948 3183.4708 3543.3700 3566.2658 3569.2743 3581.0943
redmass: 5.7445 6.3167 6.1330 5.7820 5.4883 4.7645 3.9818 3.3428 3.1221 2.2141 2.6014 6.2715 4.5689 4.4557 5.9061 4.3944 3.0897 3.0112 2.2406 1.1596 1.6636 3.1710 4.3698 3.9416 4.6800 4.9026 5.0787 6.2772 5.3459 3.1701 2.5428 1.7448 5.1553 3.6106 1.2537 2.6722 2.0915 4.3792 1.9443 3.0773 4.4505 5.1199 5.7469 4.1854 3.4895 3.8881 4.5052 4.9883 4.9734 4.1740 5.9277 4.0482 4.1572 4.2472 3.0213 3.8850 3.4666 2.4915 1.5528 4.2197 1.9439 5.1166 4.9712 6.4172 5.9011 2.0446 3.0491 2.9376 1.9401 3.9170 4.7653 3.3434 2.7021 2.7280 2.2813 2.6667 2.7760 1.3038 2.4489 2.9174 2.7198 1.8029 1.8152 1.6666 1.2604 1.9137 1.7915 1.1462 1.1429 1.6753 1.2417 1.8397 1.2405 1.2762 1.5118 1.3855 1.4261 1.3483 1.2039 1.2392 1.3429 1.3398 1.2126 1.4168 1.3012 2.3482 1.4240 1.7020 1.2462 1.4366 1.4871 1.3744 1.6147 1.2102 1.0771 1.0498 1.0523 1.0812 1.0509 1.0470 9.5013 8.2130 12.6464 1.0837 1.0787 1.0627 1.0828 1.0361 1.0653 1.0830 1.0806 1.0847 1.0295 1.0851 1.1044 1.0873 1.0876 1.0969 1.0970 1.0993 1.1044 1.1046 1.0946 1.0656 1.0657 1.0660 1.0667
irintensity: 0.1409 0.6479 0.5888 1.2855 0.8187 2.9280 3.0838 3.1350 0.1314 2.0593 1.0923 0.6778 6.1597 4.1908 2.0182 1.1512 32.4841 8.6015 37.7128 7.1573 63.2505 39.7538 15.0400 0.4730 6.7045 15.9155 7.4497 10.7645 1.9735 4.9703 20.2174 114.4834 3.9209 26.9095 90.6070 37.5658 112.9584 1.9891 96.7177 17.5939 6.1591 16.2092 4.1709 26.4912 20.5684 35.3231 6.9577 17.0184 2.5566 11.4590 17.5611 5.1887 1.7064 126.1196 20.4853 69.4531 14.5708 26.4087 15.9281 58.3851 27.5622 25.4326 139.8010 164.7966 39.5209 25.7111 40.9153 486.1560 4.6284 143.5892 407.7862 38.5579 10.1669 31.5702 22.0726 44.1611 11.4817 1.1351 31.9259 35.1962 42.9698 72.5660 6.4497 9.5911 11.5993 82.7200 8.8451 34.0797 8.7871 45.7689 6.6256 54.9850 33.2861 1.2771 45.2509 5.2030 12.8367 10.7089 41.0856 54.7348 1.6211 7.5165 5.6652 11.9001 5.2253 21.2361 7.9608 2.9249 27.0047 13.9497 5.2458 1.3380 2.3349 25.4057 19.3669 12.2439 11.2963 8.5879 5.6268 10.2722 357.2231 117.5151 181.8963 19.0073 20.9771 16.9868 6.7067 29.4216 7.8419 47.3111 5.9420 9.5835 45.3731 67.3226 36.7843 2.7672 11.1579 6.9085 41.5970 30.8437 24.9218 16.9472 0.5499 22.7358 23.4837 22.5467 6.3397
temp: 298.150 k
press: 1.00000 atm
elementType: 8 8 8 8 8 8 8 8 8 8 6 6 6 6 6 6 6 6 6 6 6 6 6 6 6 6 6 1 1 1 1 1 1 1 1 1 1 1 1 1 1 1 1 1 1 1 1 1 1 1 1
symmnumber: 1
zpe: 1054631.9 jmol-1
zpe.correction: 0.401688 hartree
zpe.thermalcorrener: 0.429700 hartree
zpe.thermalcorrenthalpy: 0.430644 hartree
zpe.thermalcorrgfe: 0.341923 hartree
zpe.sumelectzpe: -1412.288929 hartree
zpe.sumelectthermal: -1412.260917 hartree
zpe.sumelectthermalent: -1412.259973 hartree
zpe.sumelectthermalfe: -1412.348694 hartree
dipole: -3.1889 1.4520 4.0149
dipole: 5.3289
quadrupole: -159.1658 -151.5149 -162.0545
quadrupole: 0.9669 13.1226 -0.3324
quadrupole: -1.5874 6.0635 -4.4761 0.9669 13.1226 -0.3324
hfenergy: -1412.690617 hartree
pointgroup: C01 [X(C17H24O10)]
dipole: -1.2579808 0.6776603 1.5341798 debye
polarizability: 277.6294802|4.5582615|204.0711348|-8.715442|2.3485828|165.2058923 unknown
InChI: InChI=1S/C17H24O10/c1-6-3-8(19)11-7(15(23)24-2)5-25-16(10(6)11)27-17-14(22)13(21)12(20)9(4-18)26-17/h5-6,9-14,16-18,20-22H,3-4H2,1-2H3
charge 0 multiplicity 1
51 atoms
O  -0.849111 -1.109328 0.793767
O  0.978618 -1.9827 -0.373793
O  -2.206328 0.583283 -0.064211
O  3.202568 2.01173 -1.148606
O  -3.14595 -2.998614 0.616774
O  -5.700921 -1.629273 0.526933
O  -5.76103 0.681043 -1.162334
O  5.387485 -0.107166 -0.017365
O  -2.223171 2.879208 -1.819466
O  5.082836 -1.87793 -1.511105
C  1.302955 -0.028133 1.189018
C  0.75773 1.397414 1.54375
C  2.685876 0.229444 0.533277
C  0.388831 -0.717352 0.169715
C  1.252562 2.28546 0.367531
C  2.488188 1.581364 -0.217888
C  3.180198 -0.924291 -0.307319
C  1.288191 1.876548 2.913012
C  -2.012128 -0.872241 -0.027258
C  -3.218482 -1.536289 0.649575
C  -4.482224 -1.162289 -0.138629
C  -4.633964 0.361935 -0.287011
C  -3.357633 0.956385 -0.923334
C  2.332883 -1.937972 -0.669518
C  4.597962 -1.046012 -0.700276
C  -3.385653 2.47382 -1.014038
C  6.817268 -0.093587 -0.393692
H  1.379757 -0.677066 2.079447
H  -0.345362 1.374235 1.573394
H  3.435804 0.437013 1.322675
H  0.191652 -0.067624 -0.70653
H  1.514856 3.316125 0.668437
H  0.484706 2.378414 -0.427243
H  2.393464 1.930826 2.932064
H  0.903343 2.885935 3.146652
H  0.967705 1.196691 3.72374
H  -1.858328 -1.262615 -1.05944
H  -3.279859 -1.157402 1.6909
H  -4.40441 -1.618924 -1.150572
H  -4.787229 0.796128 0.72482
H  -3.220092 0.535896 -1.942525
H  2.667176 -2.822592 -1.217914
H  -3.332768 2.906415 0.007101
H  -4.341122 2.767753 -1.49177
H  -2.319475 -3.287306 1.081018
H  -5.612409 -2.605061 0.677409
H  -6.53678 0.148345 -0.845973
H  -2.296749 3.840626 -2.04105
H  7.279275 -1.074922 -0.191519
H  7.265346 0.693862 0.228717
H  6.923143 0.141791 -1.465947
