program: Orca
programVersion: 5.0.2
elementType: Cl Cl F F F F O O C C C C C C C C C C C C C C C H H H H H H H H H H H H
charge: 0
multiplicity: 1
keywords: wb97x-d3
keywords: def2-TZVPP
keywords: def2/J RIJCOSX
keywords: DEFGRID2
keywords: scfconv7
keywords: smallprint printgap noloewdin
keywords: NOSOSCF
formula: C15H12Cl2F4O2
InChI: InChI=1/C15H12Cl2F4O2/c1-15(2)7(3-10(16)17)11(15)14(22)23-5-6-12(20)8(18)4-9(19)13(6)21/h3-4,7,11H,5H2,1-2H3
35 atoms
Cl -1.99549 1.354973 2.110441
Cl -4.170051 2.704507 0.779667
F  0.936771 1.557428 -1.003756
F  4.095125 -1.926613 -0.789956
F  5.03464 -0.929254 1.50202
F  1.840392 2.504476 1.321626
O  0.506603 -0.810706 -2.277412
O  0.393427 -2.11036 -0.467902
C  -2.697616 -2.063026 -0.895771
C  -1.60269 -1.16522 -1.416093
C  -2.348345 -0.827896 -0.123787
C  -2.393407 -3.396177 -0.256583
C  -3.953783 -2.091576 -1.734549
C  -3.198998 0.366977 -0.093777
C  -0.15867 -1.447104 -1.310305
C  -3.125364 1.334837 0.812204
C  1.927972 -0.823327 -2.228726
C  2.472943 -0.230523 -0.956307
C  1.938204 0.919318 -0.395619
C  3.528726 -0.828545 -0.287939
C  4.019386 -0.312626 0.896102
C  2.41252 1.419327 0.801945
C  3.461905 0.813967 1.459441
H  -1.872842 -0.562693 -2.275872
H  -1.76893 -1.010734 0.77421
H  -2.154495 -4.146716 -1.011733
H  -1.571163 -3.358445 0.452617
H  -3.275364 -3.744316 0.283315
H  -3.888344 -2.889198 -2.476578
H  -4.829581 -2.287773 -1.113426
H  -4.129132 -1.163603 -2.278196
H  -3.94312 0.486102 -0.872365
H  2.242524 -0.23129 -3.087317
H  2.302217 -1.836019 -2.375746
H  3.839727 1.215286 2.391106
elementType: Cl F O C H
totalener: -2049.16536864 hartree
nucrepener: 2321.59950088 hartree
electener: -4370.76486952 hartree
oneelecener: -7440.25189120 hartree
twoeener: 3069.48702168 hartree
cpcmener: -0.02089499 hartree
kineticenergy: 2043.55615571 hartree
xcener: -143.168627927244 hartree
chargesum: -0.0000000
charge: -0.056711 -0.059250 -0.201072 -0.203648 -0.202915 -0.203237 -0.282161 -0.451468 0.111421 -0.049358 -0.017353 -0.270203 -0.281938 -0.174628 0.374622 0.036353 0.071924 -0.098439 0.198612 0.229313 0.198855 0.197218 -0.176010 0.096876 0.088674 0.098961 0.095416 0.095258 0.099385 0.104296 0.091703 0.127335 0.134104 0.124509 0.153556
qa: -0.0567 -0.0592 -0.2011 -0.2036 -0.2029 -0.2032 -0.2822 -0.4515 0.1114 -0.0494 -0.0174 -0.2702 -0.2819 -0.1746 0.3746 0.0364 0.0719 -0.0984 0.1986 0.2293 0.1989 0.1972 -0.1760 0.0969 0.0887 0.0990 0.0954 0.0953 0.0994 0.1043 0.0917 0.1273 0.1341 0.1245 0.1536
va: 1.2700 1.2460 1.0954 1.0954 1.0854 1.0849 2.1204 2.0541 3.7660 3.8024 3.9080 3.8891 3.9131 3.8848 4.1746 4.2165 3.8437 3.5572 3.9376 3.9185 3.9575 3.9593 3.8702 1.0329 1.0430 0.9998 1.0211 1.0002 1.0013 0.9998 1.0042 1.0205 0.9921 1.0145 0.9986
dispcorr: -0.018027144 hartree
energy: -2049.183395778904
dipole: -20.69630 20.22043 -0.47587 -24.93584 24.59675 -0.33909 -15.71584 14.37906 -1.33677
magnitude: 1.45890 au
magnitude: 3.70823 debye
