program: Orca
programVersion: 5.0.2
elementType: Cl Cl F F F F O O C C C C C C C C C C C C C C C H H H H H H H H H H H H
charge: 0
multiplicity: 1
keywords: wb97x-d3
keywords: def2-TZVPP
keywords: def2/J RIJCOSX
keywords: DEFGRID2
keywords: scfconv7
keywords: smallprint printgap noloewdin
keywords: NOSOSCF
formula: C15H12Cl2F4O2
InChI: InChI=1/C15H12Cl2F4O2/c1-15(2)7(3-10(16)17)11(15)14(22)23-5-6-12(20)8(18)4-9(19)13(6)21/h3-4,7,11H,5H2,1-2H3
35 atoms
Cl -1.673852 -0.422286 1.773688
Cl -4.379646 0.127104 2.615808
F  4.055279 1.58882 -1.827078
F  1.215568 -1.089988 0.79201
F  2.519318 -0.309586 3.00064
F  5.394062 2.31024 0.376857
O  0.469266 0.196674 -1.662489
O  -0.257747 -1.891645 -2.048112
C  -3.030801 -0.496238 -2.363576
C  -1.815087 -0.160737 -1.514402
C  -2.901777 -1.071563 -0.993138
C  -2.922102 -1.413213 -3.556895
C  -3.995832 0.646061 -2.577264
C  -3.770229 -0.633739 0.122398
C  -0.481875 -0.744257 -1.774463
C  -3.329715 -0.344109 1.339723
C  1.828329 -0.198901 -1.795412
C  2.587556 0.237915 -0.575275
C  3.662929 1.108639 -0.64786
C  2.226649 -0.233765 0.679245
C  2.904573 0.157467 1.817459
C  4.356617 1.486761 0.489783
C  3.979159 1.019972 1.730777
H  -1.796107 0.847446 -1.117336
H  -2.616941 -2.120507 -0.958952
H  -2.552515 -0.871454 -4.429371
H  -2.263977 -2.260371 -3.384599
H  -3.9102 -1.803069 -3.807897
H  -5.001776 0.268207 -2.771295
H  -4.05203 1.313671 -1.717172
H  -3.697802 1.242916 -3.44033
H  -4.838918 -0.574615 -0.04867
H  2.231293 0.27576 -2.688898
H  1.907603 -1.278811 -1.927381
H  4.517364 1.320109 2.61941
totalener: -2049.14917423 hartree
nucrepener: 2296.27273376 hartree
electener: -4345.42190798 hartree
oneelecener: -7389.08560376 hartree
twoeener: 3043.66369578 hartree
kineticenergy: 2043.58664034 hartree
xcener: -143.169078039113 hartree
chargesum: 0.0000000
charge: -0.031787 -0.044803 -0.188651 -0.184123 -0.180633 -0.182008 -0.268918 -0.382461 0.115733 -0.155141 -0.016483 -0.253464 -0.268369 -0.253363 0.378872 0.101014 0.051312 -0.132146 0.221949 0.226533 0.184007 0.189160 -0.173297 0.104931 0.109066 0.086384 0.105425 0.084634 0.092436 0.088170 0.094999 0.117015 0.105188 0.126228 0.132589
qa: -0.0318 -0.0448 -0.1887 -0.1841 -0.1806 -0.1820 -0.2689 -0.3825 0.1157 -0.1551 -0.0165 -0.2535 -0.2684 -0.2534 0.3789 0.1010 0.0513 -0.1321 0.2219 0.2265 0.1840 0.1892 -0.1733 0.1049 0.1091 0.0864 0.1054 0.0846 0.0924 0.0882 0.0950 0.1170 0.1052 0.1262 0.1326
va: 1.3166 1.2607 1.1141 1.1230 1.1156 1.1132 2.1162 2.1205 3.7167 3.8808 3.8405 3.9027 3.9140 3.9115 4.1773 4.2009 3.8559 3.6452 3.9050 3.8714 4.0276 3.9918 3.8691 1.0266 1.0273 1.0019 1.0215 1.0024 1.0015 1.0005 1.0064 1.0178 1.0089 1.0216 1.0076
dispcorr: -0.017985167 hartree
energy: -2049.167159392302
dipole: -24.90978 24.63688 -0.27290 -5.34122 5.74346 0.40224 -30.34377 29.80708 -0.53670
magnitude: 0.72409 au
magnitude: 1.84050 debye
